{"text_format":"1","workbook":"xlsx","n_sheets":9,"sheets":["Ana Sayfa","Temel Bilgiler","Sınıflarınız","Sınıf-Dönem-Sınav Seçim Sayfası","NOT Baremi","Analiz","E-OKULA PUAN AKTAR","Yıl-Dönem-Sınav No Liste","KULLANIM REHBERİ"],"not_rendered":{"charts":3,"images":18,"macros":1,"external_links":1,"defined_names":50,"comments":3,"pivot_tables":0},"unopened":[],"bounds":{"document_bytes":16777216,"sheet_cells":100000,"rows_first":2000,"rows_last":500,"rows_between":2000,"halvings":0,"cell_chars":16384,"cell_head_chars":4096},"cells_cut":0,"cells_raw":0,"read":"whole","date_system":"1900"}

{"sheet":"Ana Sayfa","index":0,"n_rows":0,"n_cols":0,"rows_kept":0,"cut":false,"hidden":false,"merged":[]}

{"sheet":"Temel Bilgiler","index":1,"n_rows":14,"n_cols":8,"rows_kept":14,"cut":false,"hidden":false,"merged":[[13,4,14,6],[13,7,14,11],[9,7,10,11],[11,4,12,6],[11,7,12,11],[9,4,10,6],[1,4,3,11],[5,7,6,11],[7,7,8,11],[5,4,6,6],[7,4,8,6]]}
[]
[null,null,null,null,"TEMEL BİLGİLER"]
[]
[]
[]
[null,null,null,null,"OKULUN ADI",null,null,"FATİH SULTAN MEHMET ORTAOKULU"]
[]
[null,null,null,null,"DERSİN ADI",null,null,"MATEMATİK"]
[]
[null,null,null,null,"DERSİN ÖĞRETMENİ",null,null,"Kerime YUVAKLIGİL"]
[]
[null,null,null,null,"BRANŞI",null,null,"Matematik"]
[]
[null,null,null,null,"OKUL TÜRÜ",null,null,"Ortaokul"]

{"sheet":"Sınıflarınız","index":2,"n_rows":991,"n_cols":8,"rows_kept":991,"cut":false,"hidden":false,"merged":[[0,3,44,3],[46,3,91,3],[93,3,138,3],[140,3,185,3],[187,3,232,3],[234,3,279,3],[281,3,326,3],[328,3,373,3],[375,3,420,3],[422,3,467,3],[516,3,561,3],[563,3,608,3],[610,3,655,3],[657,3,702,3],[469,3,514,3]]}
[1,1301,"Hüseyin BAY",{"$f":"G4","v":"8-A"}]
[2,1305,"Ahmet KESKİN"]
[3,"…","…",null,null,"S.No","Sınıf İsmi"]
[4,"…","…",null,null,1,"8-A",1]
[5,null,null,null,null,2,"8-B",47]
[6,null,null,null,null,3,"…",94]
[7,null,null,null,null,4,"…",141]
[8,null,null,null,null,5,"…",188]
[9,null,null,null,null,6,null,235]
[10,null,null,null,null,7,null,282]
[11,null,null,null,null,8,null,329]
[12,null,null,null,null,9,null,376]
[13,null,null,null,null,10,null,423]
[14,null,null,null,null,11,null,470]
[15,null,null,null,null,12,null,517]
[16,null,null,null,null,13,null,564]
[17,null,null,null,null,14,null,611]
[18,null,null,null,null,15,null,658]
[19,null,null,null,null,16]
[20,null,null,null,null,17]
[21,null,null,null,null,18]
[22,null,null,null,null,19]
[23,null,null,null,null,20]
[24,null,null,null,null,21]
[25,null,null,null,null,22]
[26,null,null,null,null,23]
[27,null,null,null,null,24]
[28,null,null,null,null,25]
[29]
[30]
[31]
[32]
[33]
[34]
[35]
[36]
[37]
[38]
[39]
[40]
[41]
[42]
[43]
[44]
[45]
[46]
[47,null,null,{"$f":"G5","v":"8-B"}]
[48]
[49]
[50]
[51]
[52]
[53]
[54]
[55]
[56]
[57]
[58]
[59]
[60]
[61]
[62]
[63]
[64]
[65]
[66]
[67]
[68]
[69]
[70]
[71]
[72]
[73]
[74]
[75]
[76]
[77]
[78]
[79]
[80]
[81]
[82]
[83]
[84]
[85]
[86]
[87]
[88]
[89]
[90]
[91]
[92]
[93]
[94,null,null,{"$f":"G6","v":"…"}]
[95]
[96]
[97]
[98]
[99]
[100]
[101]
[102]
[103]
[104]
[105]
[106]
[107]
[108]
[109]
[110]
[111]
[112]
[113]
[114]
[115]
[116]
[117]
[118]
[119]
[120]
[121]
[122]
[123]
[124]
[125]
[126]
[127]
[128]
[129]
[130]
[131]
[132]
[133]
[134]
[135]
[136]
[137]
[138]
[139]
[140]
[141,null,null,{"$f":"G7","v":"…"}]
[142]
[143]
[144]
[145]
[146]
[147]
[148]
[149]
[150]
[151]
[152]
[153]
[154]
[155]
[156]
[157]
[158]
[159]
[160]
[161]
[162]
[163]
[164]
[165]
[166]
[167]
[168]
[169]
[170]
[171]
[172]
[173]
[174]
[175]
[176]
[177]
[178]
[179]
[180]
[181]
[182]
[183]
[184]
[185]
[186]
[187]
[188,null,null,{"$f":"G8","v":"…"}]
[189]
[190]
[191]
[192]
[193]
[194]
[195]
[196]
[197]
[198]
[199]
[200]
[201]
[202]
[203]
[204]
[205]
[206]
[207]
[208]
[209]
[210]
[211]
[212]
[213]
[214]
[215]
[216]
[217]
[218]
[219]
[220]
[221]
[222]
[223]
[224]
[225]
[226]
[227]
[228]
[229]
[230]
[231]
[232]
[233]
[234]
[235,null,null,{"$f":"G9","v":0}]
[236]
[237]
[238]
[239]
[240]
[241]
[242]
[243]
[244]
[245]
[246]
[247]
[248]
[249]
[250]
[251]
[252]
[253]
[254]
[255]
[256]
[257]
[258]
[259]
[260]
[261]
[262]
[263]
[264]
[265]
[266]
[267]
[268]
[269]
[270]
[271]
[272]
[273]
[274]
[275]
[276]
[277]
[278]
[279]
[280]
[281]
[282,null,null,{"$f":"G10","v":0}]
[283]
[284]
[285]
[286]
[287]
[288]
[289]
[290]
[291]
[292]
[293]
[294]
[295]
[296]
[297]
[298]
[299]
[300]
[301]
[302]
[303]
[304]
[305]
[306]
[307]
[308]
[309]
[310]
[311]
[312]
[313]
[314]
[315]
[316]
[317]
[318]
[319]
[320]
[321]
[322]
[323]
[324]
[325]
[326]
[327]
[328]
[329,null,null,{"$f":"G11","v":0}]
[330]
[331]
[332]
[333]
[334]
[335]
[336]
[337]
[338]
[339]
[340]
[341]
[342]
[343]
[344]
[345]
[346]
[347]
[348]
[349]
[350]
[351]
[352]
[353]
[354]
[355]
[356]
[357]
[358]
[359]
[360]
[361]
[362]
[363]
[364]
[365]
[366]
[367]
[368]
[369]
[370]
[371]
[372]
[373]
[374]
[375]
[376,null,null,{"$f":"G12","v":0}]
[377]
[378]
[379]
[380]
[381]
[382]
[383]
[384]
[385]
[386]
[387]
[388]
[389]
[390]
[391]
[392]
[393]
[394]
[395]
[396]
[397]
[398]
[399]
[400]
[401]
[402]
[403]
[404]
[405]
[406]
[407]
[408]
[409]
[410]
[411]
[412]
[413]
[414]
[415]
[416]
[417]
[418]
[419]
[420]
[421]
[422]
[423,null,null,{"$f":"G13","v":0}]
[424]
[425]
[426]
[427]
[428]
[429]
[430]
[431]
[432]
[433]
[434]
[435]
[436]
[437]
[438]
[439]
[440]
[441]
[442]
[443]
[444]
[445]
[446]
[447]
[448]
[449]
[450]
[451]
[452]
[453]
[454]
[455]
[456]
[457]
[458]
[459]
[460]
[461]
[462]
[463]
[464]
[465]
[466]
[467]
[468]
[469]
[470,null,null,{"$f":"G14","v":0}]
[471]
[472]
[473]
[474]
[475]
[476]
[477]
[478]
[479]
[480]
[481]
[482]
[483]
[484]
[485]
[486]
[487]
[488]
[489]
[490]
[491]
[492]
[493]
[494]
[495]
[496]
[497]
[498]
[499]
[500]
[501]
[502]
[503]
[504]
[505]
[506]
[507]
[508]
[509]
[510]
[511]
[512]
[513]
[514]
[515]
[516]
[517,null,null,{"$f":"G15","v":0}]
[518]
[519]
[520]
[521]
[522]
[523]
[524]
[525]
[526]
[527]
[528]
[529]
[530]
[531]
[532]
[533]
[534]
[535]
[536]
[537]
[538]
[539]
[540]
[541]
[542]
[543]
[544]
[545]
[546]
[547]
[548]
[549]
[550]
[551]
[552]
[553]
[554]
[555]
[556]
[557]
[558]
[559]
[560]
[561]
[562]
[563]
[564,null,null,{"$f":"G16","v":0}]
[565]
[566]
[567]
[568]
[569]
[570]
[571]
[572]
[573]
[574]
[575]
[576]
[577]
[578]
[579]
[580]
[581]
[582]
[583]
[584]
[585]
[586]
[587]
[588]
[589]
[590]
[591]
[592]
[593]
[594]
[595]
[596]
[597]
[598]
[599]
[600]
[601]
[602]
[603]
[604]
[605]
[606]
[607]
[608]
[609]
[610]
[611,null,null,{"$f":"G17","v":0}]
[612]
[613]
[614]
[615]
[616]
[617]
[618]
[619]
[620]
[621]
[622]
[623]
[624]
[625]
[626]
[627]
[628]
[629]
[630]
[631]
[632]
[633]
[634]
[635]
[636]
[637]
[638]
[639]
[640]
[641]
[642]
[643]
[644]
[645]
[646]
[647]
[648]
[649]
[650]
[651]
[652]
[653]
[654]
[655]
[656]
[657]
[658,null,null,{"$f":"G18","v":0}]
[659]
[660]
[661]
[662]
[663]
[664]
[665]
[666]
[667]
[668]
[669]
[670]
[671]
[672]
[673]
[674]
[675]
[676]
[677]
[678]
[679]
[680]
[681]
[682]
[683]
[684]
[685]
[686]
[687]
[688]
[689]
[690]
[691]
[692]
[693]
[694]
[695]
[696]
[697]
[698]
[699]
[700]
[701]
[702]
[703]
[704]
[705]
[706]
[707]
[708]
[709]
[710]
[711]
[712]
[713]
[714]
[715]
[716]
[717]
[718]
[719]
[720]
[721]
[722]
[723]
[724]
[725]
[726]
[727]
[728]
[729]
[730]
[731]
[732]
[733]
[734]
[735]
[736]
[737]
[738]
[739]
[740]
[741]
[742]
[743]
[744]
[745]
[746]
[747]
[748]
[749]
[750]
[751]
[752]
[753]
[754]
[755]
[756]
[757]
[758]
[759]
[760]
[761]
[762]
[763]
[764]
[765]
[766]
[767]
[768]
[769]
[770]
[771]
[772]
[773]
[774]
[775]
[776]
[777]
[778]
[779]
[780]
[781]
[782]
[783]
[784]
[785]
[786]
[787]
[788]
[789]
[790]
[791]
[792]
[793]
[794]
[795]
[796]
[797]
[798]
[799]
[800]
[801]
[802]
[803]
[804]
[805]
[806]
[807]
[808]
[809]
[810]
[811]
[812]
[813]
[814]
[815]
[816]
[817]
[818]
[819]
[820]
[821]
[822]
[823]
[824]
[825]
[826]
[827]
[828]
[829]
[830]
[831]
[832]
[833]
[834]
[835]
[836]
[837]
[838]
[839]
[840]
[841]
[842]
[843]
[844]
[845]
[846]
[847]
[848]
[849]
[850]
[851]
[852]
[853]
[854]
[855]
[856]
[857]
[858]
[859]
[860]
[861]
[862]
[863]
[864]
[865]
[866]
[867]
[868]
[869]
[870]
[871]
[872]
[873]
[874]
[875]
[876]
[877]
[878]
[879]
[880]
[881]
[882]
[883]
[884]
[885]
[886]
[887]
[888]
[889]
[890]
[891]
[892]
[893]
[894]
[895]
[896]
[897]
[898]
[899]
[900]
[901]
[902]
[903]
[904]
[905]
[906]
[907]
[908]
[909]
[910]
[911]
[912]
[913]
[914]
[915]
[916]
[917]
[918]
[919]
[920]
[921]
[922]
[923]
[924]
[925]
[926]
[927]
[928]
[929]
[930]
[931]
[932]
[933]
[934]
[935]
[936]
[937]
[938]
[939]
[940]
[941]
[942]
[943]
[944]
[945]
[946]
[947]
[948]
[949]
[950]
[951]
[952]
[953]
[954]
[955]
[956]
[957]
[958]
[959]
[960]
[961]
[962]
[963]
[964]
[965]
[966]
[967]
[968]
[969]
[970]
[971]
[972]
[973]
[974]
[975]
[976]
[977]
[978]
[979]
[980]
[981]
[982]
[983]
[984]
[985]
[986]
[987]
[988]
[989]
[990]
[991]

{"sheet":"Sınıf-Dönem-Sınav Seçim Sayfası","index":3,"n_rows":48,"n_cols":13,"rows_kept":48,"cut":false,"hidden":false,"merged":[[1,5,1,7]]}
[]
[null,null,null,null,null,"SINIF LİSTESİ",null,null,null,"SINIF SEÇ","EĞT.-ÖĞRT.    YILI SEÇ","DÖNEM SEÇ","SINAV SEÇ"]
[null,null,null,null,null,"SIRA \nNO","ÖĞRENCİ NO","ADI ve SOYADI",null,"8-A","2017-2018","II.DÖNEM","I.SINAV"]
[null,null,null,null,{"$f":"VLOOKUP(J3,Sınıflarınız!$G$4:$H$31,2,0)","v":1},{"$f":"IF(G4>0,1,\" \")","v":1},{"$f":"IF(E4<>\"\",VLOOKUP($E4,Sınıflarınız!A:C,2),\"\")","v":1301},{"$f":"IF(G4<>\"\",VLOOKUP($E4,Sınıflarınız!A:C,3),\"\")","v":"Hüseyin BAY"}]
[null,null,null,null,{"$f":"E4+1","v":2},{"$f":"IF(G5>0,F4+1,\" \")","v":2},{"$f":"IF(E5<>\"\",VLOOKUP($E5,Sınıflarınız!A:C,2),\"\")","v":1305},{"$f":"IF(G5<>\"\",VLOOKUP($E5,Sınıflarınız!A:C,3),\"\")","v":"Ahmet KESKİN"}]
[null,null,null,null,{"$f":"E5+1","v":3},{"$f":"IF(G6>0,F5+1,\" \")","v":3},{"$f":"IF(E6<>\"\",VLOOKUP($E6,Sınıflarınız!A:C,2),\"\")","v":"…"},{"$f":"IF(G6<>\"\",VLOOKUP($E6,Sınıflarınız!A:C,3),\"\")","v":"…"}]
[null,null,null,null,{"$f":"E6+1","v":4},4,{"$f":"IF(E7<>\"\",VLOOKUP($E7,Sınıflarınız!A:C,2),\"\")","v":"…"},{"$f":"IF(G7<>\"\",VLOOKUP($E7,Sınıflarınız!A:C,3),\"\")","v":"…"}]
[null,null,null,null,5," ",{"$f":"IF(E8<>\"\",VLOOKUP($E8,Sınıflarınız!A:C,2),\"\")","v":0},{"$f":"IF(G8<>\"\",VLOOKUP($E8,Sınıflarınız!A:C,3),\"\")","v":0}]
[null,null,null,null,6," ",{"$f":"IF(E9<>\"\",VLOOKUP($E9,Sınıflarınız!A:C,2),\"\")","v":0},{"$f":"IF(G9<>\"\",VLOOKUP($E9,Sınıflarınız!A:C,3),\"\")","v":0}]
[null,null,null,null,7," ",{"$f":"IF(E10<>\"\",VLOOKUP($E10,Sınıflarınız!A:C,2),\"\")","v":0},{"$f":"IF(G10<>\"\",VLOOKUP($E10,Sınıflarınız!A:C,3),\"\")","v":0}]
[null,null,null,null,8," ",{"$f":"IF(E11<>\"\",VLOOKUP($E11,Sınıflarınız!A:C,2),\"\")","v":0},{"$f":"IF(G11<>\"\",VLOOKUP($E11,Sınıflarınız!A:C,3),\"\")","v":0}]
[null,null,null,null,9," ",{"$f":"IF(E12<>\"\",VLOOKUP($E12,Sınıflarınız!A:C,2),\"\")","v":0},{"$f":"IF(G12<>\"\",VLOOKUP($E12,Sınıflarınız!A:C,3),\"\")","v":0}]
[null,null,null,null,10," ",{"$f":"IF(E13<>\"\",VLOOKUP($E13,Sınıflarınız!A:C,2),\"\")","v":0},{"$f":"IF(G13<>\"\",VLOOKUP($E13,Sınıflarınız!A:C,3),\"\")","v":0}]
[null,null,null,null,11," ",{"$f":"IF(E14<>\"\",VLOOKUP($E14,Sınıflarınız!A:C,2),\"\")","v":0},{"$f":"IF(G14<>\"\",VLOOKUP($E14,Sınıflarınız!A:C,3),\"\")","v":0}]
[null,null,null,null,12," ",{"$f":"IF(E15<>\"\",VLOOKUP($E15,Sınıflarınız!A:C,2),\"\")","v":0},{"$f":"IF(G15<>\"\",VLOOKUP($E15,Sınıflarınız!A:C,3),\"\")","v":0}]
[null,null,null,null,13," ",{"$f":"IF(E16<>\"\",VLOOKUP($E16,Sınıflarınız!A:C,2),\"\")","v":0},{"$f":"IF(G16<>\"\",VLOOKUP($E16,Sınıflarınız!A:C,3),\"\")","v":0}]
[null,null,null,null,14," ",{"$f":"IF(E17<>\"\",VLOOKUP($E17,Sınıflarınız!A:C,2),\"\")","v":0},{"$f":"IF(G17<>\"\",VLOOKUP($E17,Sınıflarınız!A:C,3),\"\")","v":0}]
[null,null,null,null,15," ",{"$f":"IF(E18<>\"\",VLOOKUP($E18,Sınıflarınız!A:C,2),\"\")","v":0},{"$f":"IF(G18<>\"\",VLOOKUP($E18,Sınıflarınız!A:C,3),\"\")","v":0}]
[null,null,null,null,16," ",{"$f":"IF(E19<>\"\",VLOOKUP($E19,Sınıflarınız!A:C,2),\"\")","v":0},{"$f":"IF(G19<>\"\",VLOOKUP($E19,Sınıflarınız!A:C,3),\"\")","v":0}]
[null,null,null,null,17," ",{"$f":"IF(E20<>\"\",VLOOKUP($E20,Sınıflarınız!A:C,2),\"\")","v":0},{"$f":"IF(G20<>\"\",VLOOKUP($E20,Sınıflarınız!A:C,3),\"\")","v":0}]
[null,null,null,null,18," ",{"$f":"IF(E21<>\"\",VLOOKUP($E21,Sınıflarınız!A:C,2),\"\")","v":0},{"$f":"IF(G21<>\"\",VLOOKUP($E21,Sınıflarınız!A:C,3),\"\")","v":0}]
[null,null,null,null,19," ",{"$f":"IF(E22<>\"\",VLOOKUP($E22,Sınıflarınız!A:C,2),\"\")","v":0},{"$f":"IF(G22<>\"\",VLOOKUP($E22,Sınıflarınız!A:C,3),\"\")","v":0}]
[null,null,null,null,20," ",{"$f":"IF(E23<>\"\",VLOOKUP($E23,Sınıflarınız!A:C,2),\"\")","v":0},{"$f":"IF(G23<>\"\",VLOOKUP($E23,Sınıflarınız!A:C,3),\"\")","v":0}]
[null,null,null,null,21," ",{"$f":"IF(E24<>\"\",VLOOKUP($E24,Sınıflarınız!A:C,2),\"\")","v":0},{"$f":"IF(G24<>\"\",VLOOKUP($E24,Sınıflarınız!A:C,3),\"\")","v":0}]
[null,null,null,null,22," ",{"$f":"IF(E25<>\"\",VLOOKUP($E25,Sınıflarınız!A:C,2),\"\")","v":0},{"$f":"IF(G25<>\"\",VLOOKUP($E25,Sınıflarınız!A:C,3),\"\")","v":0}]
[null,null,null,null,23," ",{"$f":"IF(E26<>\"\",VLOOKUP($E26,Sınıflarınız!A:C,2),\"\")","v":0},{"$f":"IF(G26<>\"\",VLOOKUP($E26,Sınıflarınız!A:C,3),\"\")","v":0}]
[null,null,null,null,24," ",{"$f":"IF(E27<>\"\",VLOOKUP($E27,Sınıflarınız!A:C,2),\"\")","v":0},{"$f":"IF(G27<>\"\",VLOOKUP($E27,Sınıflarınız!A:C,3),\"\")","v":0}]
[null,null,null,null,25," ",{"$f":"IF(E28<>\"\",VLOOKUP($E28,Sınıflarınız!A:C,2),\"\")","v":0},{"$f":"IF(G28<>\"\",VLOOKUP($E28,Sınıflarınız!A:C,3),\"\")","v":0}]
[null,null,null,null,26," ",{"$f":"IF(E29<>\"\",VLOOKUP($E29,Sınıflarınız!A:C,2),\"\")","v":0},{"$f":"IF(G29<>\"\",VLOOKUP($E29,Sınıflarınız!A:C,3),\"\")","v":0}]
[null,null,null,null,27," ",{"$f":"IF(E30<>\"\",VLOOKUP($E30,Sınıflarınız!A:C,2),\"\")","v":0},{"$f":"IF(G30<>\"\",VLOOKUP($E30,Sınıflarınız!A:C,3),\"\")","v":0}]
[null,null,null,null,28," ",{"$f":"IF(E31<>\"\",VLOOKUP($E31,Sınıflarınız!A:C,2),\"\")","v":0},{"$f":"IF(G31<>\"\",VLOOKUP($E31,Sınıflarınız!A:C,3),\"\")","v":0}]
[null,null,null,null,29," ",{"$f":"IF(E32<>\"\",VLOOKUP($E32,Sınıflarınız!A:C,2),\"\")","v":0},{"$f":"IF(G32<>\"\",VLOOKUP($E32,Sınıflarınız!A:C,3),\"\")","v":0}]
[null,null,null,null,30," ",{"$f":"IF(E33<>\"\",VLOOKUP($E33,Sınıflarınız!A:C,2),\"\")","v":0},{"$f":"IF(G33<>\"\",VLOOKUP($E33,Sınıflarınız!A:C,3),\"\")","v":0}]
[null,null,null,null,31," ",{"$f":"IF(E34<>\"\",VLOOKUP($E34,Sınıflarınız!A:C,2),\"\")","v":0},{"$f":"IF(G34<>\"\",VLOOKUP($E34,Sınıflarınız!A:C,3),\"\")","v":0}]
[null,null,null,null,32," ",{"$f":"IF(E35<>\"\",VLOOKUP($E35,Sınıflarınız!A:C,2),\"\")","v":0},{"$f":"IF(G35<>\"\",VLOOKUP($E35,Sınıflarınız!A:C,3),\"\")","v":0}]
[null,null,null,null,33," ",{"$f":"IF(E36<>\"\",VLOOKUP($E36,Sınıflarınız!A:C,2),\"\")","v":0},{"$f":"IF(G36<>\"\",VLOOKUP($E36,Sınıflarınız!A:C,3),\"\")","v":0}]
[null,null,null,null,34," ",{"$f":"IF(E37<>\"\",VLOOKUP($E37,Sınıflarınız!A:C,2),\"\")","v":0},{"$f":"IF(G37<>\"\",VLOOKUP($E37,Sınıflarınız!A:C,3),\"\")","v":0}]
[null,null,null,null,35," ",{"$f":"IF(E38<>\"\",VLOOKUP($E38,Sınıflarınız!A:C,2),\"\")","v":0},{"$f":"IF(G38<>\"\",VLOOKUP($E38,Sınıflarınız!A:C,3),\"\")","v":0}]
[null,null,null,null,36,{"$f":"IF(G39>0,F38+1,\" \")","v":" "},{"$f":"IF(E39<>\"\",VLOOKUP($E39,Sınıflarınız!A:C,2),\"\")","v":0},{"$f":"IF(G39<>\"\",VLOOKUP($E39,Sınıflarınız!A:C,3),\"\")","v":0}]
[null,null,null,null,37," ",{"$f":"IF(E40<>\"\",VLOOKUP($E40,Sınıflarınız!A:C,2),\"\")","v":0},{"$f":"IF(G40<>\"\",VLOOKUP($E40,Sınıflarınız!A:C,3),\"\")","v":0}]
[null,null,null,null,38," ",{"$f":"IF(E41<>\"\",VLOOKUP($E41,Sınıflarınız!A:C,2),\"\")","v":0},{"$f":"IF(G41<>\"\",VLOOKUP($E41,Sınıflarınız!A:C,3),\"\")","v":0}]
[null,null,null,null,39," ",{"$f":"IF(E42<>\"\",VLOOKUP($E42,Sınıflarınız!A:C,2),\"\")","v":0},{"$f":"IF(G42<>\"\",VLOOKUP($E42,Sınıflarınız!A:C,3),\"\")","v":0}]
[null,null,null,null,40," ",{"$f":"IF(E43<>\"\",VLOOKUP($E43,Sınıflarınız!A:C,2),\"\")","v":0},{"$f":"IF(G43<>\"\",VLOOKUP($E43,Sınıflarınız!A:C,3),\"\")","v":0}]
[null,null,null,null,41," ",{"$f":"IF(E44<>\"\",VLOOKUP($E44,Sınıflarınız!A:C,2),\"\")","v":0},{"$f":"IF(G44<>\"\",VLOOKUP($E44,Sınıflarınız!A:C,3),\"\")","v":0}]
[null,null,null,null,42," ",{"$f":"IF(E45<>\"\",VLOOKUP($E45,Sınıflarınız!A:C,2),\"\")","v":0},{"$f":"IF(G45<>\"\",VLOOKUP($E45,Sınıflarınız!A:C,3),\"\")","v":0}]
[null,null,null,null,43," ",{"$f":"IF(E46<>\"\",VLOOKUP($E46,Sınıflarınız!A:C,2),\"\")","v":0},{"$f":"IF(G46<>\"\",VLOOKUP($E46,Sınıflarınız!A:C,3),\"\")","v":0}]
[null,null,null,null,44," ",{"$f":"IF(E47<>\"\",VLOOKUP($E47,Sınıflarınız!A:C,2),\"\")","v":0},{"$f":"IF(G47<>\"\",VLOOKUP($E47,Sınıflarınız!A:C,3),\"\")","v":0}]
[null,null,null,null,45," ",{"$f":"IF(E48<>\"\",VLOOKUP($E48,Sınıflarınız!A:C,2),\"\")","v":0},{"$f":"IF(G48<>\"\",VLOOKUP($E48,Sınıflarınız!A:C,3),\"\")","v":0}]

{"sheet":"NOT Baremi","index":4,"n_rows":9,"n_cols":45,"rows_kept":9,"cut":false,"hidden":false,"merged":[[0,1,1,36],[8,1,8,3],[7,1,7,3],[5,44,7,44],[2,1,3,44],[5,1,6,43]]}
[null,"NOT BAREMİ"]
[]
[]
[]
[]
[null,"SINAVDAKİ SORULARIN PUAN DEĞERLERİ",null,null,null,null,null,null,null,null,null,null,null,null,null,null,null,null,null,null,null,null,null,null,null,null,null,null,null,null,null,null,null,null,null,null,null,null,null,null,null,null,null,null,"TOPLAM PUAN"]
[]
[null,"SORU NO",null,null,1,2,3,4,5,6,7,8,9,10,11,12,13,14,15,16,17,18,19,20,21,22,23,24,25,26,27,28,29,30,31,32,33,34,35,36,37,38,39,40]
[null,"PUAN DEĞERİ",null,null,10,10,10,10,10,10,10,10,10,10,null,null,null,null,null,null,null,null,null,null,null,null,null,null,null,null,null,null,null,null,null,null,null,null,null,null,null,null,null,null,{"$f":"IF(SUM(E9:AR9)=0,\" \",IF(SUM(E9:AR9)>100,\"HATA\",SUM(E9:AR9)))","v":100}]

{"sheet":"Analiz","index":5,"n_rows":121,"n_cols":48,"rows_kept":121,"cut":false,"hidden":false,"merged":[[45,2,45,4],[46,2,46,4],[47,2,47,4],[48,2,48,4],[86,23,86,26],[85,23,85,26],[82,16,82,18],[83,16,83,18],[84,16,84,18],[84,23,84,26],[83,23,83,26],[85,16,85,18],[86,16,86,18],[83,19,83,21],[84,19,84,21],[85,19,85,21],[86,19,86,21],[74,6,75,7],[74,11,75,22],[77,4,78,6],[65,0,66,46],[67,15,67,30],[68,45,69,46],[68,40,69,44],[135,1,141,11],[119,3,119,12],[119,32,119,44],[90,32,90,46],[104,42,104,46],[100,12,100,30],[102,32,102,40],[103,32,103,40],[93,31,93,39],[102,42,102,46],[103,42,103,46],[108,16,108,17],[108,26,108,27],[108,34,108,35],[108,0,115,2],[120,2,120,15],[105,32,106,40],[105,42,105,46],[106,42,106,46],[104,32,104,40],[90,11,90,31],[100,4,100,10],[101,4,101,10],[102,4,102,10],[72,40,72,44],[82,23,82,26],[70,45,71,46],[82,19,82,21],[77,11,78,18],[77,19,78,20],[74,8,75,10],[81,16,81,31],[74,28,75,46],[77,35,78,36],[69,6,70,38],[81,32,81,33],[70,40,71,44],[82,29,82,31],[82,27,82,28],[74,23,75,24],[74,25,75,25],[74,26,75,27],[2,0,2,4],[2,45,2,46],[57,0,58,4],[59,0,60,4],[50,0,50,4],[52,0,52,4],[51,0,51,4],[53,0,53,4],[54,46,55,46],[54,0,55,4],[10,2,10,4],[19,2,19,4],[20,2,20,4],[18,2,18,4],[14,2,14,4],[57,45,58,45],[57,46,58,46],[59,45,60,45],[59,46,60,46],[43,2,43,4],[23,2,23,4],[8,2,8,4],[5,2,5,4],[6,2,6,4],[72,0,72,3],[74,0,75,3],[74,4,75,4],[74,5,75,5],[77,7,78,10],[77,27,78,34],[72,19,72,20],[72,11,72,18],[87,16,87,21],[87,23,87,26],[84,27,84,28],[85,27,85,28],[86,27,86,28],[83,29,83,31],[84,29,84,31],[85,29,85,31],[86,29,86,31],[83,27,83,28],[7,2,7,4],[163,16,163,18],[163,8,163,11],[163,13,163,14],[162,8,162,11],[162,13,162,14],[21,2,21,4],[22,2,22,4],[37,2,37,4],[32,2,32,4],[31,2,31,4],[38,2,38,4],[35,2,35,4],[36,2,36,4],[44,2,44,4],[49,2,49,4],[34,2,34,4],[39,2,39,4],[40,2,40,4],[41,2,41,4],[42,2,42,4],[162,16,162,18],[77,0,78,3],[63,0,64,46],[0,45,0,46],[1,45,1,46],[0,0,0,44],[1,0,1,44],[15,2,15,4],[9,2,9,4],[56,0,56,4],[3,46,4,46],[54,45,55,45],[33,2,33,4],[28,2,28,4],[29,2,29,4],[11,2,11,4],[16,2,16,4],[17,2,17,4],[13,2,13,4],[26,2,26,4],[24,2,24,4],[30,2,30,4],[27,2,27,4],[3,0,3,4],[4,2,4,4],[12,2,12,4],[25,2,25,4]]}
[{"$f":"'Sınıf-Dönem-Sınav Seçim Sayfası'!K3&\" EĞİTİM ÖĞRETİM YILI \"&'Temel Bilgiler'!H6","v":"2017-2018 EĞİTİM ÖĞRETİM YILI FATİH SULTAN MEHMET ORTAOKULU"},null,null,null,null,null,null,null,null,null,null,null,null,null,null,null,null,null,null,null,null,null,null,null,null,null,null,null,null,null,null,null,null,null,null,null,null,null,null,null,null,null,null,null,null,"Sınav Tarihi"]
[{"$f":"'Sınıf-Dönem-Sınav Seçim Sayfası'!J3&\" SINIFI \"&'Temel Bilgiler'!H8&\" DERSİ \"&'Sınıf-Dönem-Sınav Seçim Sayfası'!L3&\"  \"& 'Sınıf-Dönem-Sınav Seçim Sayfası'!M3& \" ANALİZİ\"","v":"8-A SINIFI MATEMATİK DERSİ II.DÖNEM  I.SINAV ANALİZİ"}]
["SORUNUN KONUSU",null,null,null,null,"Üçgende açılar","Yamuk alan hesabı","Özel üçgenler","Trigonometri","Paralel kenar","Çemberde açı","Deltoid","Piramitler","Küre","Vektörler",null,null,null,null,null,null,null,null,null,null,null,null,null,null,null,null,null,null,null,null,null,null,null,null,null,null,null,null,null,null,"İletişim: huseyin0207@hotmail.com"]
["SORULARIN PUAN DEĞERİ",null,null,null,null,{"$f":"IF('NOT Baremi'!E9=0,\" \",'NOT Baremi'!E9)","v":10},{"$f":"IF('NOT Baremi'!F9=0,\" \",'NOT Baremi'!F9)","v":10},{"$f":"IF('NOT Baremi'!G9=0,\" \",'NOT Baremi'!G9)","v":10},{"$f":"IF('NOT Baremi'!H9=0,\" \",'NOT Baremi'!H9)","v":10},{"$f":"IF('NOT Baremi'!I9=0,\" \",'NOT Baremi'!I9)","v":10},{"$f":"IF('NOT Baremi'!J9=0,\" \",'NOT Baremi'!J9)","v":10},{"$f":"IF('NOT Baremi'!K9=0,\" \",'NOT Baremi'!K9)","v":10},{"$f":"IF('NOT Baremi'!L9=0,\" \",'NOT Baremi'!L9)","v":10},{"$f":"IF('NOT Baremi'!M9=0,\" \",'NOT Baremi'!M9)","v":10},{"$f":"IF('NOT Baremi'!N9=0,\" \",'NOT Baremi'!N9)","v":10},{"$f":"IF('NOT Baremi'!O9=0,\" \",'NOT Baremi'!O9)","v":" "},{"$f":"IF('NOT Baremi'!P9=0,\" \",'NOT Baremi'!P9)","v":" "},{"$f":"IF('NOT Baremi'!Q9=0,\" \",'NOT Baremi'!Q9)","v":" "},{"$f":"IF('NOT Baremi'!R9=0,\" \",'NOT Baremi'!R9)","v":" "},{"$f":"IF('NOT Baremi'!S9=0,\" \",'NOT Baremi'!S9)","v":" "},{"$f":"IF('NOT Baremi'!T9=0,\" \",'NOT Baremi'!T9)","v":" "},{"$f":"IF('NOT Baremi'!U9=0,\" \",'NOT Baremi'!U9)","v":" "},{"$f":"IF('NOT Baremi'!V9=0,\" \",'NOT Baremi'!V9)","v":" "},{"$f":"IF('NOT Baremi'!W9=0,\" \",'NOT Baremi'!W9)","v":" "},{"$f":"IF('NOT Baremi'!X9=0,\" \",'NOT Baremi'!X9)","v":" "},{"$f":"IF('NOT Baremi'!Y9=0,\" \",'NOT Baremi'!Y9)","v":" "},{"$f":"IF('NOT Baremi'!Z9=0,\" \",'NOT Baremi'!Z9)","v":" "},{"$f":"IF('NOT Baremi'!AA9=0,\" \",'NOT Baremi'!AA9)","v":" "},{"$f":"IF('NOT Baremi'!AB9=0,\" \",'NOT Baremi'!AB9)","v":" "},{"$f":"IF('NOT Baremi'!AC9=0,\" \",'NOT Baremi'!AC9)","v":" "},{"$f":"IF('NOT Baremi'!AD9=0,\" \",'NOT Baremi'!AD9)","v":" "},{"$f":"IF('NOT Baremi'!AE9=0,\" \",'NOT Baremi'!AE9)","v":" "},{"$f":"IF('NOT Baremi'!AF9=0,\" \",'NOT Baremi'!AF9)","v":" "},{"$f":"IF('NOT Baremi'!AG9=0,\" \",'NOT Baremi'!AG9)","v":" "},{"$f":"IF('NOT Baremi'!AH9=0,\" \",'NOT Baremi'!AH9)","v":" "},{"$f":"IF('NOT Baremi'!AI9=0,\" \",'NOT Baremi'!AI9)","v":" "},{"$f":"IF('NOT Baremi'!AJ9=0,\" \",'NOT Baremi'!AJ9)","v":" "},{"$f":"IF('NOT Baremi'!AK9=0,\" \",'NOT Baremi'!AK9)","v":" "},{"$f":"IF('NOT Baremi'!AL9=0,\" \",'NOT Baremi'!AL9)","v":" "},{"$f":"IF('NOT Baremi'!AM9=0,\" \",'NOT Baremi'!AM9)","v":" "},{"$f":"IF('NOT Baremi'!AN9=0,\" \",'NOT Baremi'!AN9)","v":" "},{"$f":"IF('NOT Baremi'!AO9=0,\" \",'NOT Baremi'!AO9)","v":" "},{"$f":"IF('NOT Baremi'!AP9=0,\" \",'NOT Baremi'!AP9)","v":" "},{"$f":"IF('NOT Baremi'!AQ9=0,\" \",'NOT Baremi'!AQ9)","v":" "},{"$f":"IF('NOT Baremi'!AR9=0,\" \",'NOT Baremi'!AR9)","v":" "},{"$f":"IF(SUM(F4:AS4)=0,\" \",SUM(F4:AS4))","v":100},"Derece",{"$f":"IF('Temel Bilgiler'!H14=\"Lise\",1,0)","v":0}]
["SIRA NO","ÖĞR.NO","AD SOYAD",null,null,{"$f":"IF('NOT Baremi'!E9>0,'NOT Baremi'!E8&\".\"&\"SORU\",\" \")","v":"1.SORU"},{"$f":"IF('NOT Baremi'!F9>0,'NOT Baremi'!F8&\".\"&\"SORU\",\" \")","v":"2.SORU"},{"$f":"IF('NOT Baremi'!G9>0,'NOT Baremi'!G8&\".\"&\"SORU\",\" \")","v":"3.SORU"},{"$f":"IF('NOT Baremi'!H9>0,'NOT Baremi'!H8&\".\"&\"SORU\",\" \")","v":"4.SORU"},{"$f":"IF('NOT Baremi'!I9>0,'NOT Baremi'!I8&\".\"&\"SORU\",\" \")","v":"5.SORU"},{"$f":"IF('NOT Baremi'!J9>0,'NOT Baremi'!J8&\".\"&\"SORU\",\" \")","v":"6.SORU"},{"$f":"IF('NOT Baremi'!K9>0,'NOT Baremi'!K8&\".\"&\"SORU\",\" \")","v":"7.SORU"},{"$f":"IF('NOT Baremi'!L9>0,'NOT Baremi'!L8&\".\"&\"SORU\",\" \")","v":"8.SORU"},{"$f":"IF('NOT Baremi'!M9>0,'NOT Baremi'!M8&\".\"&\"SORU\",\" \")","v":"9.SORU"},{"$f":"IF('NOT Baremi'!N9>0,'NOT Baremi'!N8&\".\"&\"SORU\",\" \")","v":"10.SORU"},{"$f":"IF('NOT Baremi'!O9>0,'NOT Baremi'!O8&\".\"&\"SORU\",\" \")","v":" "},{"$f":"IF('NOT Baremi'!P9>0,'NOT Baremi'!P8&\".\"&\"SORU\",\" \")","v":" "},{"$f":"IF('NOT Baremi'!Q9>0,'NOT Baremi'!Q8&\".\"&\"SORU\",\" \")","v":" "},{"$f":"IF('NOT Baremi'!R9>0,'NOT Baremi'!R8&\".\"&\"SORU\",\" \")","v":" "},{"$f":"IF('NOT Baremi'!S9>0,'NOT Baremi'!S8&\".\"&\"SORU\",\" \")","v":" "},{"$f":"IF('NOT Baremi'!T9>0,'NOT Baremi'!T8&\".\"&\"SORU\",\" \")","v":" "},{"$f":"IF('NOT Baremi'!U9>0,'NOT Baremi'!U8&\".\"&\"SORU\",\" \")","v":" "},{"$f":"IF('NOT Baremi'!V9>0,'NOT Baremi'!V8&\".\"&\"SORU\",\" \")","v":" "},{"$f":"IF('NOT Baremi'!W9>0,'NOT Baremi'!W8&\".\"&\"SORU\",\" \")","v":" "},{"$f":"IF('NOT Baremi'!X9>0,'NOT Baremi'!X8&\".\"&\"SORU\",\" \")","v":" "},{"$f":"IF('NOT Baremi'!Y9>0,'NOT Baremi'!Y8&\".\"&\"SORU\",\" \")","v":" "},{"$f":"IF('NOT Baremi'!Z9>0,'NOT Baremi'!Z8&\".\"&\"SORU\",\" \")","v":" "},{"$f":"IF('NOT Baremi'!AA9>0,'NOT Baremi'!AA8&\".\"&\"SORU\",\" \")","v":" "},{"$f":"IF('NOT Baremi'!AB9>0,'NOT Baremi'!AB8&\".\"&\"SORU\",\" \")","v":" "},{"$f":"IF('NOT Baremi'!AC9>0,'NOT Baremi'!AC8&\".\"&\"SORU\",\" \")","v":" "},{"$f":"IF('NOT Baremi'!AD9>0,'NOT Baremi'!AD8&\".\"&\"SORU\",\" \")","v":" "},{"$f":"IF('NOT Baremi'!AE9>0,'NOT Baremi'!AE8&\".\"&\"SORU\",\" \")","v":" "},{"$f":"IF('NOT Baremi'!AF9>0,'NOT Baremi'!AF8&\".\"&\"SORU\",\" \")","v":" "},{"$f":"IF('NOT Baremi'!AG9>0,'NOT Baremi'!AG8&\".\"&\"SORU\",\" \")","v":" "},{"$f":"IF('NOT Baremi'!AH9>0,'NOT Baremi'!AH8&\".\"&\"SORU\",\" \")","v":" "},{"$f":"IF('NOT Baremi'!AI9>0,'NOT Baremi'!AI8&\".\"&\"SORU\",\" \")","v":" "},{"$f":"IF('NOT Baremi'!AJ9>0,'NOT Baremi'!AJ8&\".\"&\"SORU\",\" \")","v":" "},{"$f":"IF('NOT Baremi'!AK9>0,'NOT Baremi'!AK8&\".\"&\"SORU\",\" \")","v":" "},{"$f":"IF('NOT Baremi'!AL9>0,'NOT Baremi'!AL8&\".\"&\"SORU\",\" \")","v":" "},{"$f":"IF('NOT Baremi'!AM9>0,'NOT Baremi'!AM8&\".\"&\"SORU\",\" \")","v":" "},{"$f":"IF('NOT Baremi'!AN9>0,'NOT Baremi'!AN8&\".\"&\"SORU\",\" \")","v":" "},{"$f":"IF('NOT Baremi'!AO9>0,'NOT Baremi'!AO8&\".\"&\"SORU\",\" \")","v":" "},{"$f":"IF('NOT Baremi'!AP9>0,'NOT Baremi'!AP8&\".\"&\"SORU\",\" \")","v":" "},{"$f":"IF('NOT Baremi'!AQ9>0,'NOT Baremi'!AQ8&\".\"&\"SORU\",\" \")","v":" "},{"$f":"IF('NOT Baremi'!AR9>0,'NOT Baremi'!AR8&\".\"&\"SORU\",\" \")","v":" "},"TOPLAM \nPUAN"]
[{"$f":"'Sınıf-Dönem-Sınav Seçim Sayfası'!F4","v":1},{"$f":"IF('Sınıf-Dönem-Sınav Seçim Sayfası'!G4=0,\" \",'Sınıf-Dönem-Sınav Seçim Sayfası'!G4)","v":1301},{"$f":"IF('Sınıf-Dönem-Sınav Seçim Sayfası'!H4=0,\" \",'Sınıf-Dönem-Sınav Seçim Sayfası'!H4)","v":"Hüseyin BAY"},null,null,10,10,10,10,10,10,10,10,10,10,null,null,null,null,null,null,null,null,null,null,null,null,null,null,null,null,null,null,null,null,null,null,null,null,null,null,null,null,null,null,{"$f":"IF(COUNTBLANK(F6:AS6)=COLUMNS(F6:AS6),\" \",IF(SUM(F6:AS6)=0,0,SUM(F6:AS6)))","v":100},{"$f":"IF($AV$4=1,IF(AT6=\" \",\" \",IF(AT6>=85,\"Pekiyi\",IF(AT6>=70,\"İyi\",IF(AT6>=60,\"Orta\",IF(AT6>=50,\"Geçer\",IF(AT6>=0,\"Geçmez\",0)))))),IF(AT6=\" \",\" \",IF(AT6>=85,\"Pekiyi\",IF(AT6>=70,\"İyi\",IF(AT6>=55,\"Orta\",IF(AT6>=45,\"Geçer\",IF(AT6>=0,\"Geçmez\",0)))))))","v":"Pekiyi"}]
[{"$f":"'Sınıf-Dönem-Sınav Seçim Sayfası'!F5","v":2},{"$f":"IF('Sınıf-Dönem-Sınav Seçim Sayfası'!G5=0,\" \",'Sınıf-Dönem-Sınav Seçim Sayfası'!G5)","v":1305},{"$f":"IF('Sınıf-Dönem-Sınav Seçim Sayfası'!H5=0,\" \",'Sınıf-Dönem-Sınav Seçim Sayfası'!H5)","v":"Ahmet KESKİN"},null,null,10,10,10,10,10,10,10,10,10,10,null,null,null,null,null,null,null,null,null,null,null,null,null,null,null,null,null,null,null,null,null,null,null,null,null,null,null,null,null,null,{"$f":"IF(COUNTBLANK(F7:AS7)=COLUMNS(F7:AS7),\" \",IF(SUM(F7:AS7)=0,0,SUM(F7:AS7)))","v":100},{"$f":"IF($AV$4=1,IF(AT7=\" \",\" \",IF(AT7>=85,\"Pekiyi\",IF(AT7>=70,\"İyi\",IF(AT7>=60,\"Orta\",IF(AT7>=50,\"Geçer\",IF(AT7>=0,\"Geçmez\",0)))))),IF(AT7=\" \",\" \",IF(AT7>=85,\"Pekiyi\",IF(AT7>=70,\"İyi\",IF(AT7>=55,\"Orta\",IF(AT7>=45,\"Geçer\",IF(AT7>=0,\"Geçmez\",0)))))))","v":"Pekiyi"}]
[{"$f":"'Sınıf-Dönem-Sınav Seçim Sayfası'!F6","v":3},{"$f":"IF('Sınıf-Dönem-Sınav Seçim Sayfası'!G6=0,\" \",'Sınıf-Dönem-Sınav Seçim Sayfası'!G6)","v":"…"},{"$f":"IF('Sınıf-Dönem-Sınav Seçim Sayfası'!H6=0,\" \",'Sınıf-Dönem-Sınav Seçim Sayfası'!H6)","v":"…"},null,null,null,null,null,null,null,null,null,null,null,null,null,null,null,null,null,null,null,null,null,null,null,null,null,null,null,null,null,null,null,null,null,null,null,null,null,null,null,null,null,null," "," "]
[{"$f":"'Sınıf-Dönem-Sınav Seçim Sayfası'!F7","v":4},{"$f":"IF('Sınıf-Dönem-Sınav Seçim Sayfası'!G7=0,\" \",'Sınıf-Dönem-Sınav Seçim Sayfası'!G7)","v":"…"},{"$f":"IF('Sınıf-Dönem-Sınav Seçim Sayfası'!H7=0,\" \",'Sınıf-Dönem-Sınav Seçim Sayfası'!H7)","v":"…"},null,null,null,null,null,null,null,null,null,null,null,null,null,null,null,null,null,null,null,null,null,null,null,null,null,null,null,null,null,null,null,null,null,null,null,null,null,null,null,null,null,null," "," "]
[{"$f":"'Sınıf-Dönem-Sınav Seçim Sayfası'!F8","v":" "},{"$f":"IF('Sınıf-Dönem-Sınav Seçim Sayfası'!G8=0,\" \",'Sınıf-Dönem-Sınav Seçim Sayfası'!G8)","v":" "},{"$f":"IF('Sınıf-Dönem-Sınav Seçim Sayfası'!H8=0,\" \",'Sınıf-Dönem-Sınav Seçim Sayfası'!H8)","v":" "},null,null,null,null,null,null,null,null,null,null,null,null,null,null,null,null,null,null,null,null,null,null,null,null,null,null,null,null,null,null,null,null,null,null,null,null,null,null,null,null,null,null," "," "]
[{"$f":"'Sınıf-Dönem-Sınav Seçim Sayfası'!F9","v":" "},{"$f":"IF('Sınıf-Dönem-Sınav Seçim Sayfası'!G9=0,\" \",'Sınıf-Dönem-Sınav Seçim Sayfası'!G9)","v":" "},{"$f":"IF('Sınıf-Dönem-Sınav Seçim Sayfası'!H9=0,\" \",'Sınıf-Dönem-Sınav Seçim Sayfası'!H9)","v":" "},null,null,null,null,null,null,null,null,null,null,null,null,null,null,null,null,null,null,null,null,null,null,null,null,null,null,null,null,null,null,null,null,null,null,null,null,null,null,null,null,null,null," "," "]
[{"$f":"'Sınıf-Dönem-Sınav Seçim Sayfası'!F10","v":" "},{"$f":"IF('Sınıf-Dönem-Sınav Seçim Sayfası'!G10=0,\" \",'Sınıf-Dönem-Sınav Seçim Sayfası'!G10)","v":" "},{"$f":"IF('Sınıf-Dönem-Sınav Seçim Sayfası'!H10=0,\" \",'Sınıf-Dönem-Sınav Seçim Sayfası'!H10)","v":" "},null,null,null,null,null,null,null,null,null,null,null,null,null,null,null,null,null,null,null,null,null,null,null,null,null,null,null,null,null,null,null,null,null,null,null,null,null,null,null,null,null,null," "," "]
[{"$f":"'Sınıf-Dönem-Sınav Seçim Sayfası'!F11","v":" "},{"$f":"IF('Sınıf-Dönem-Sınav Seçim Sayfası'!G11=0,\" \",'Sınıf-Dönem-Sınav Seçim Sayfası'!G11)","v":" "},{"$f":"IF('Sınıf-Dönem-Sınav Seçim Sayfası'!H11=0,\" \",'Sınıf-Dönem-Sınav Seçim Sayfası'!H11)","v":" "},null,null,null,null,null,null,null,null,null,null,null,null,null,null,null,null,null,null,null,null,null,null,null,null,null,null,null,null,null,null,null,null,null,null,null,null,null,null,null,null,null,null," "," "]
[{"$f":"'Sınıf-Dönem-Sınav Seçim Sayfası'!F12","v":" "},{"$f":"IF('Sınıf-Dönem-Sınav Seçim Sayfası'!G12=0,\" \",'Sınıf-Dönem-Sınav Seçim Sayfası'!G12)","v":" "},{"$f":"IF('Sınıf-Dönem-Sınav Seçim Sayfası'!H12=0,\" \",'Sınıf-Dönem-Sınav Seçim Sayfası'!H12)","v":" "},null,null,null,null,null,null,null,null,null,null,null,null,null,null,null,null,null,null,null,null,null,null,null,null,null,null,null,null,null,null,null,null,null,null,null,null,null,null,null,null,null,null," "," "]
[{"$f":"'Sınıf-Dönem-Sınav Seçim Sayfası'!F13","v":" "},{"$f":"IF('Sınıf-Dönem-Sınav Seçim Sayfası'!G13=0,\" \",'Sınıf-Dönem-Sınav Seçim Sayfası'!G13)","v":" "},{"$f":"IF('Sınıf-Dönem-Sınav Seçim Sayfası'!H13=0,\" \",'Sınıf-Dönem-Sınav Seçim Sayfası'!H13)","v":" "},null,null,null,null,null,null,null,null,null,null,null,null,null,null,null,null,null,null,null,null,null,null,null,null,null,null,null,null,null,null,null,null,null,null,null,null,null,null,null,null,null,null," "," "]
[{"$f":"'Sınıf-Dönem-Sınav Seçim Sayfası'!F14","v":" "},{"$f":"IF('Sınıf-Dönem-Sınav Seçim Sayfası'!G14=0,\" \",'Sınıf-Dönem-Sınav Seçim Sayfası'!G14)","v":" "},{"$f":"IF('Sınıf-Dönem-Sınav Seçim Sayfası'!H14=0,\" \",'Sınıf-Dönem-Sınav Seçim Sayfası'!H14)","v":" "},null,null,null,null,null,null,null,null,null,null,null,null,null,null,null,null,null,null,null,null,null,null,null,null,null,null,null,null,null,null,null,null,null,null,null,null,null,null,null,null,null,null," "," "]
[{"$f":"'Sınıf-Dönem-Sınav Seçim Sayfası'!F15","v":" "},{"$f":"IF('Sınıf-Dönem-Sınav Seçim Sayfası'!G15=0,\" \",'Sınıf-Dönem-Sınav Seçim Sayfası'!G15)","v":" "},{"$f":"IF('Sınıf-Dönem-Sınav Seçim Sayfası'!H15=0,\" \",'Sınıf-Dönem-Sınav Seçim Sayfası'!H15)","v":" "},null,null,null,null,null,null,null,null,null,null,null,null,null,null,null,null,null,null,null,null,null,null,null,null,null,null,null,null,null,null,null,null,null,null,null,null,null,null,null,null,null,null," "," "]
[{"$f":"'Sınıf-Dönem-Sınav Seçim Sayfası'!F16","v":" "},{"$f":"IF('Sınıf-Dönem-Sınav Seçim Sayfası'!G16=0,\" \",'Sınıf-Dönem-Sınav Seçim Sayfası'!G16)","v":" "},{"$f":"IF('Sınıf-Dönem-Sınav Seçim Sayfası'!H16=0,\" \",'Sınıf-Dönem-Sınav Seçim Sayfası'!H16)","v":" "},null,null,null,null,null,null,null,null,null,null,null,null,null,null,null,null,null,null,null,null,null,null,null,null,null,null,null,null,null,null,null,null,null,null,null,null,null,null,null,null,null,null," "," "]
[{"$f":"'Sınıf-Dönem-Sınav Seçim Sayfası'!F17","v":" "},{"$f":"IF('Sınıf-Dönem-Sınav Seçim Sayfası'!G17=0,\" \",'Sınıf-Dönem-Sınav Seçim Sayfası'!G17)","v":" "},{"$f":"IF('Sınıf-Dönem-Sınav Seçim Sayfası'!H17=0,\" \",'Sınıf-Dönem-Sınav Seçim Sayfası'!H17)","v":" "},null,null,null,null,null,null,null,null,null,null,null,null,null,null,null,null,null,null,null,null,null,null,null,null,null,null,null,null,null,null,null,null,null,null,null,null,null,null,null,null,null,null," "," "]
[{"$f":"'Sınıf-Dönem-Sınav Seçim Sayfası'!F18","v":" "},{"$f":"IF('Sınıf-Dönem-Sınav Seçim Sayfası'!G18=0,\" \",'Sınıf-Dönem-Sınav Seçim Sayfası'!G18)","v":" "},{"$f":"IF('Sınıf-Dönem-Sınav Seçim Sayfası'!H18=0,\" \",'Sınıf-Dönem-Sınav Seçim Sayfası'!H18)","v":" "},null,null,null,null,null,null,null,null,null,null,null,null,null,null,null,null,null,null,null,null,null,null,null,null,null,null,null,null,null,null,null,null,null,null,null,null,null,null,null,null,null,null," "," "]
[{"$f":"'Sınıf-Dönem-Sınav Seçim Sayfası'!F19","v":" "},{"$f":"IF('Sınıf-Dönem-Sınav Seçim Sayfası'!G19=0,\" \",'Sınıf-Dönem-Sınav Seçim Sayfası'!G19)","v":" "},{"$f":"IF('Sınıf-Dönem-Sınav Seçim Sayfası'!H19=0,\" \",'Sınıf-Dönem-Sınav Seçim Sayfası'!H19)","v":" "},null,null,null,null,null,null,null,null,null,null,null,null,null,null,null,null,null,null,null,null,null,null,null,null,null,null,null,null,null,null,null,null,null,null,null,null,null,null,null,null,null,null," "," "]
[{"$f":"'Sınıf-Dönem-Sınav Seçim Sayfası'!F20","v":" "},{"$f":"IF('Sınıf-Dönem-Sınav Seçim Sayfası'!G20=0,\" \",'Sınıf-Dönem-Sınav Seçim Sayfası'!G20)","v":" "},{"$f":"IF('Sınıf-Dönem-Sınav Seçim Sayfası'!H20=0,\" \",'Sınıf-Dönem-Sınav Seçim Sayfası'!H20)","v":" "},null,null,null,null,null,null,null,null,null,null,null,null,null,null,null,null,null,null,null,null,null,null,null,null,null,null,null,null,null,null,null,null,null,null,null,null,null,null,null,null,null,null," "," "]
[{"$f":"'Sınıf-Dönem-Sınav Seçim Sayfası'!F21","v":" "},{"$f":"IF('Sınıf-Dönem-Sınav Seçim Sayfası'!G21=0,\" \",'Sınıf-Dönem-Sınav Seçim Sayfası'!G21)","v":" "},{"$f":"IF('Sınıf-Dönem-Sınav Seçim Sayfası'!H21=0,\" \",'Sınıf-Dönem-Sınav Seçim Sayfası'!H21)","v":" "},null,null,null,null,null,null,null,null,null,null,null,null,null,null,null,null,null,null,null,null,null,null,null,null,null,null,null,null,null,null,null,null,null,null,null,null,null,null,null,null,null,null," "," "]
[{"$f":"'Sınıf-Dönem-Sınav Seçim Sayfası'!F22","v":" "},{"$f":"IF('Sınıf-Dönem-Sınav Seçim Sayfası'!G22=0,\" \",'Sınıf-Dönem-Sınav Seçim Sayfası'!G22)","v":" "},{"$f":"IF('Sınıf-Dönem-Sınav Seçim Sayfası'!H22=0,\" \",'Sınıf-Dönem-Sınav Seçim Sayfası'!H22)","v":" "},null,null,null,null,null,null,null,null,null,null,null,null,null,null,null,null,null,null,null,null,null,null,null,null,null,null,null,null,null,null,null,null,null,null,null,null,null,null,null,null,null,null," "," "]
[{"$f":"'Sınıf-Dönem-Sınav Seçim Sayfası'!F23","v":" "},{"$f":"IF('Sınıf-Dönem-Sınav Seçim Sayfası'!G23=0,\" \",'Sınıf-Dönem-Sınav Seçim Sayfası'!G23)","v":" "},{"$f":"IF('Sınıf-Dönem-Sınav Seçim Sayfası'!H23=0,\" \",'Sınıf-Dönem-Sınav Seçim Sayfası'!H23)","v":" "},null,null,null,null,null,null,null,null,null,null,null,null,null,null,null,null,null,null,null,null,null,null,null,null,null,null,null,null,null,null,null,null,null,null,null,null,null,null,null,null,null,null," "," "]
[{"$f":"'Sınıf-Dönem-Sınav Seçim Sayfası'!F24","v":" "},{"$f":"IF('Sınıf-Dönem-Sınav Seçim Sayfası'!G24=0,\" \",'Sınıf-Dönem-Sınav Seçim Sayfası'!G24)","v":" "},{"$f":"IF('Sınıf-Dönem-Sınav Seçim Sayfası'!H24=0,\" \",'Sınıf-Dönem-Sınav Seçim Sayfası'!H24)","v":" "},null,null,null,null,null,null,null,null,null,null,null,null,null,null,null,null,null,null,null,null,null,null,null,null,null,null,null,null,null,null,null,null,null,null,null,null,null,null,null,null,null,null," "," "]
[{"$f":"'Sınıf-Dönem-Sınav Seçim Sayfası'!F25","v":" "},{"$f":"IF('Sınıf-Dönem-Sınav Seçim Sayfası'!G25=0,\" \",'Sınıf-Dönem-Sınav Seçim Sayfası'!G25)","v":" "},{"$f":"IF('Sınıf-Dönem-Sınav Seçim Sayfası'!H25=0,\" \",'Sınıf-Dönem-Sınav Seçim Sayfası'!H25)","v":" "},null,null,null,null,null,null,null,null,null,null,null,null,null,null,null,null,null,null,null,null,null,null,null,null,null,null,null,null,null,null,null,null,null,null,null,null,null,null,null,null,null,null," "," "]
[{"$f":"'Sınıf-Dönem-Sınav Seçim Sayfası'!F26","v":" "},{"$f":"IF('Sınıf-Dönem-Sınav Seçim Sayfası'!G26=0,\" \",'Sınıf-Dönem-Sınav Seçim Sayfası'!G26)","v":" "},{"$f":"IF('Sınıf-Dönem-Sınav Seçim Sayfası'!H26=0,\" \",'Sınıf-Dönem-Sınav Seçim Sayfası'!H26)","v":" "},null,null,null,null,null,null,null,null,null,null,null,null,null,null,null,null,null,null,null,null,null,null,null,null,null,null,null,null,null,null,null,null,null,null,null,null,null,null,null,null,null,null," "," "]
[{"$f":"'Sınıf-Dönem-Sınav Seçim Sayfası'!F27","v":" "},{"$f":"IF('Sınıf-Dönem-Sınav Seçim Sayfası'!G27=0,\" \",'Sınıf-Dönem-Sınav Seçim Sayfası'!G27)","v":" "},{"$f":"IF('Sınıf-Dönem-Sınav Seçim Sayfası'!H27=0,\" \",'Sınıf-Dönem-Sınav Seçim Sayfası'!H27)","v":" "},null,null,null,null,null,null,null,null,null,null,null,null,null,null,null,null,null,null,null,null,null,null,null,null,null,null,null,null,null,null,null,null,null,null,null,null,null,null,null,null,null,null," "," "]
[{"$f":"'Sınıf-Dönem-Sınav Seçim Sayfası'!F28","v":" "},{"$f":"IF('Sınıf-Dönem-Sınav Seçim Sayfası'!G28=0,\" \",'Sınıf-Dönem-Sınav Seçim Sayfası'!G28)","v":" "},{"$f":"IF('Sınıf-Dönem-Sınav Seçim Sayfası'!H28=0,\" \",'Sınıf-Dönem-Sınav Seçim Sayfası'!H28)","v":" "},null,null,null,null,null,null,null,null,null,null,null,null,null,null,null,null,null,null,null,null,null,null,null,null,null,null,null,null,null,null,null,null,null,null,null,null,null,null,null,null,null,null," "," "]
[{"$f":"'Sınıf-Dönem-Sınav Seçim Sayfası'!F29","v":" "},{"$f":"IF('Sınıf-Dönem-Sınav Seçim Sayfası'!G29=0,\" \",'Sınıf-Dönem-Sınav Seçim Sayfası'!G29)","v":" "},{"$f":"IF('Sınıf-Dönem-Sınav Seçim Sayfası'!H29=0,\" \",'Sınıf-Dönem-Sınav Seçim Sayfası'!H29)","v":" "},null,null,null,null,null,null,null,null,null,null,null,null,null,null,null,null,null,null,null,null,null,null,null,null,null,null,null,null,null,null,null,null,null,null,null,null,null,null,null,null,null,null," "," "]
[{"$f":"'Sınıf-Dönem-Sınav Seçim Sayfası'!F30","v":" "},{"$f":"IF('Sınıf-Dönem-Sınav Seçim Sayfası'!G30=0,\" \",'Sınıf-Dönem-Sınav Seçim Sayfası'!G30)","v":" "},{"$f":"IF('Sınıf-Dönem-Sınav Seçim Sayfası'!H30=0,\" \",'Sınıf-Dönem-Sınav Seçim Sayfası'!H30)","v":" "},null,null,null,null,null,null,null,null,null,null,null,null,null,null,null,null,null,null,null,null,null,null,null,null,null,null,null,null,null,null,null,null,null,null,null,null,null,null,null,null,null,null," "," "]
[{"$f":"'Sınıf-Dönem-Sınav Seçim Sayfası'!F31","v":" "},{"$f":"IF('Sınıf-Dönem-Sınav Seçim Sayfası'!G31=0,\" \",'Sınıf-Dönem-Sınav Seçim Sayfası'!G31)","v":" "},{"$f":"IF('Sınıf-Dönem-Sınav Seçim Sayfası'!H31=0,\" \",'Sınıf-Dönem-Sınav Seçim Sayfası'!H31)","v":" "},null,null,null,null,null,null,null,null,null,null,null,null,null,null,null,null,null,null,null,null,null,null,null,null,null,null,null,null,null,null,null,null,null,null,null,null,null,null,null,null,null,null," "," "]
[{"$f":"'Sınıf-Dönem-Sınav Seçim Sayfası'!F32","v":" "},{"$f":"IF('Sınıf-Dönem-Sınav Seçim Sayfası'!G32=0,\" \",'Sınıf-Dönem-Sınav Seçim Sayfası'!G32)","v":" "},{"$f":"IF('Sınıf-Dönem-Sınav Seçim Sayfası'!H32=0,\" \",'Sınıf-Dönem-Sınav Seçim Sayfası'!H32)","v":" "},null,null,null,null,null,null,null,null,null,null,null,null,null,null,null,null,null,null,null,null,null,null,null,null,null,null,null,null,null,null,null,null,null,null,null,null,null,null,null,null,null,null," "," "]
[{"$f":"'Sınıf-Dönem-Sınav Seçim Sayfası'!F33","v":" "},{"$f":"IF('Sınıf-Dönem-Sınav Seçim Sayfası'!G33=0,\" \",'Sınıf-Dönem-Sınav Seçim Sayfası'!G33)","v":" "},{"$f":"IF('Sınıf-Dönem-Sınav Seçim Sayfası'!H33=0,\" \",'Sınıf-Dönem-Sınav Seçim Sayfası'!H33)","v":" "},null,null,null,null,null,null,null,null,null,null,null,null,null,null,null,null,null,null,null,null,null,null,null,null,null,null,null,null,null,null,null,null,null,null,null,null,null,null,null,null,null,null," "," "]
[{"$f":"'Sınıf-Dönem-Sınav Seçim Sayfası'!F34","v":" "},{"$f":"IF('Sınıf-Dönem-Sınav Seçim Sayfası'!G34=0,\" \",'Sınıf-Dönem-Sınav Seçim Sayfası'!G34)","v":" "},{"$f":"IF('Sınıf-Dönem-Sınav Seçim Sayfası'!H34=0,\" \",'Sınıf-Dönem-Sınav Seçim Sayfası'!H34)","v":" "},null,null,null,null,null,null,null,null,null,null,null,null,null,null,null,null,null,null,null,null,null,null,null,null,null,null,null,null,null,null,null,null,null,null,null,null,null,null,null,null,null,null," "," "]
[{"$f":"'Sınıf-Dönem-Sınav Seçim Sayfası'!F35","v":" "},{"$f":"IF('Sınıf-Dönem-Sınav Seçim Sayfası'!G35=0,\" \",'Sınıf-Dönem-Sınav Seçim Sayfası'!G35)","v":" "},{"$f":"IF('Sınıf-Dönem-Sınav Seçim Sayfası'!H35=0,\" \",'Sınıf-Dönem-Sınav Seçim Sayfası'!H35)","v":" "},null,null,null,null,null,null,null,null,null,null,null,null,null,null,null,null,null,null,null,null,null,null,null,null,null,null,null,null,null,null,null,null,null,null,null,null,null,null,null,null,null,null," "," "]
[{"$f":"'Sınıf-Dönem-Sınav Seçim Sayfası'!F36","v":" "},{"$f":"IF('Sınıf-Dönem-Sınav Seçim Sayfası'!G36=0,\" \",'Sınıf-Dönem-Sınav Seçim Sayfası'!G36)","v":" "},{"$f":"IF('Sınıf-Dönem-Sınav Seçim Sayfası'!H36=0,\" \",'Sınıf-Dönem-Sınav Seçim Sayfası'!H36)","v":" "},null,null,null,null,null,null,null,null,null,null,null,null,null,null,null,null,null,null,null,null,null,null,null,null,null,null,null,null,null,null,null,null,null,null,null,null,null,null,null,null,null,null," "," "]
[{"$f":"'Sınıf-Dönem-Sınav Seçim Sayfası'!F37","v":" "},{"$f":"IF('Sınıf-Dönem-Sınav Seçim Sayfası'!G37=0,\" \",'Sınıf-Dönem-Sınav Seçim Sayfası'!G37)","v":" "},{"$f":"IF('Sınıf-Dönem-Sınav Seçim Sayfası'!H37=0,\" \",'Sınıf-Dönem-Sınav Seçim Sayfası'!H37)","v":" "},null,null,null,null,null,null,null,null,null,null,null,null,null,null,null,null,null,null,null,null,null,null,null,null,null,null,null,null,null,null,null,null,null,null,null,null,null,null,null,null,null,null," "," "]
[{"$f":"'Sınıf-Dönem-Sınav Seçim Sayfası'!F38","v":" "},{"$f":"IF('Sınıf-Dönem-Sınav Seçim Sayfası'!G38=0,\" \",'Sınıf-Dönem-Sınav Seçim Sayfası'!G38)","v":" "},{"$f":"IF('Sınıf-Dönem-Sınav Seçim Sayfası'!H38=0,\" \",'Sınıf-Dönem-Sınav Seçim Sayfası'!H38)","v":" "},null,null,null,null,null,null,null,null,null,null,null,null,null,null,null,null,null,null,null,null,null,null,null,null,null,null,null,null,null,null,null,null,null,null,null,null,null,null,null,null,null,null," "," "]
[{"$f":"'Sınıf-Dönem-Sınav Seçim Sayfası'!F39","v":" "},{"$f":"IF('Sınıf-Dönem-Sınav Seçim Sayfası'!G39=0,\" \",'Sınıf-Dönem-Sınav Seçim Sayfası'!G39)","v":" "},{"$f":"IF('Sınıf-Dönem-Sınav Seçim Sayfası'!H39=0,\" \",'Sınıf-Dönem-Sınav Seçim Sayfası'!H39)","v":" "},null,null,null,null,null,null,null,null,null,null,null,null,null,null,null,null,null,null,null,null,null,null,null,null,null,null,null,null,null,null,null,null,null,null,null,null,null,null,null,null,null,null," "," "]
[{"$f":"'Sınıf-Dönem-Sınav Seçim Sayfası'!F40","v":" "},{"$f":"IF('Sınıf-Dönem-Sınav Seçim Sayfası'!G40=0,\" \",'Sınıf-Dönem-Sınav Seçim Sayfası'!G40)","v":" "},{"$f":"IF('Sınıf-Dönem-Sınav Seçim Sayfası'!H40=0,\" \",'Sınıf-Dönem-Sınav Seçim Sayfası'!H40)","v":" "},null,null,null,null,null,null,null,null,null,null,null,null,null,null,null,null,null,null,null,null,null,null,null,null,null,null,null,null,null,null,null,null,null,null,null,null,null,null,null,null,null,null," "," "]
[{"$f":"'Sınıf-Dönem-Sınav Seçim Sayfası'!F41","v":" "},{"$f":"IF('Sınıf-Dönem-Sınav Seçim Sayfası'!G41=0,\" \",'Sınıf-Dönem-Sınav Seçim Sayfası'!G41)","v":" "},{"$f":"IF('Sınıf-Dönem-Sınav Seçim Sayfası'!H41=0,\" \",'Sınıf-Dönem-Sınav Seçim Sayfası'!H41)","v":" "},null,null,null,null,null,null,null,null,null,null,null,null,null,null,null,null,null,null,null,null,null,null,null,null,null,null,null,null,null,null,null,null,null,null,null,null,null,null,null,null,null,null," "," "]
[{"$f":"'Sınıf-Dönem-Sınav Seçim Sayfası'!F42","v":" "},{"$f":"IF('Sınıf-Dönem-Sınav Seçim Sayfası'!G42=0,\" \",'Sınıf-Dönem-Sınav Seçim Sayfası'!G42)","v":" "},{"$f":"IF('Sınıf-Dönem-Sınav Seçim Sayfası'!H42=0,\" \",'Sınıf-Dönem-Sınav Seçim Sayfası'!H42)","v":" "},null,null,null,null,null,null,null,null,null,null,null,null,null,null,null,null,null,null,null,null,null,null,null,null,null,null,null,null,null,null,null,null,null,null,null,null,null,null,null,null,null,null," "," "]
[{"$f":"'Sınıf-Dönem-Sınav Seçim Sayfası'!F43","v":" "},{"$f":"IF('Sınıf-Dönem-Sınav Seçim Sayfası'!G43=0,\" \",'Sınıf-Dönem-Sınav Seçim Sayfası'!G43)","v":" "},{"$f":"IF('Sınıf-Dönem-Sınav Seçim Sayfası'!H43=0,\" \",'Sınıf-Dönem-Sınav Seçim Sayfası'!H43)","v":" "},null,null,null,null,null,null,null,null,null,null,null,null,null,null,null,null,null,null,null,null,null,null,null,null,null,null,null,null,null,null,null,null,null,null,null,null,null,null,null,null,null,null," "," "]
[{"$f":"'Sınıf-Dönem-Sınav Seçim Sayfası'!F44","v":" "},{"$f":"IF('Sınıf-Dönem-Sınav Seçim Sayfası'!G44=0,\" \",'Sınıf-Dönem-Sınav Seçim Sayfası'!G44)","v":" "},{"$f":"IF('Sınıf-Dönem-Sınav Seçim Sayfası'!H44=0,\" \",'Sınıf-Dönem-Sınav Seçim Sayfası'!H44)","v":" "},null,null,null,null,null,null,null,null,null,null,null,null,null,null,null,null,null,null,null,null,null,null,null,null,null,null,null,null,null,null,null,null,null,null,null,null,null,null,null,null,null,null," "," "]
[{"$f":"'Sınıf-Dönem-Sınav Seçim Sayfası'!F45","v":" "},{"$f":"IF('Sınıf-Dönem-Sınav Seçim Sayfası'!G45=0,\" \",'Sınıf-Dönem-Sınav Seçim Sayfası'!G45)","v":" "},{"$f":"IF('Sınıf-Dönem-Sınav Seçim Sayfası'!H45=0,\" \",'Sınıf-Dönem-Sınav Seçim Sayfası'!H45)","v":" "},null,null,null,null,null,null,null,null,null,null,null,null,null,null,null,null,null,null,null,null,null,null,null,null,null,null,null,null,null,null,null,null,null,null,null,null,null,null,null,null,null,null," "," "]
[{"$f":"'Sınıf-Dönem-Sınav Seçim Sayfası'!F46","v":" "},{"$f":"IF('Sınıf-Dönem-Sınav Seçim Sayfası'!G46=0,\" \",'Sınıf-Dönem-Sınav Seçim Sayfası'!G46)","v":" "},{"$f":"IF('Sınıf-Dönem-Sınav Seçim Sayfası'!H46=0,\" \",'Sınıf-Dönem-Sınav Seçim Sayfası'!H46)","v":" "},null,null,null,null,null,null,null,null,null,null,null,null,null,null,null,null,null,null,null,null,null,null,null,null,null,null,null,null,null,null,null,null,null,null,null,null,null,null,null,null,null,null," "," "]
[{"$f":"'Sınıf-Dönem-Sınav Seçim Sayfası'!F47","v":" "},{"$f":"IF('Sınıf-Dönem-Sınav Seçim Sayfası'!G47=0,\" \",'Sınıf-Dönem-Sınav Seçim Sayfası'!G47)","v":" "},{"$f":"IF('Sınıf-Dönem-Sınav Seçim Sayfası'!H47=0,\" \",'Sınıf-Dönem-Sınav Seçim Sayfası'!H47)","v":" "},null,null,null,null,null,null,null,null,null,null,null,null,null,null,null,null,null,null,null,null,null,null,null,null,null,null,null,null,null,null,null,null,null,null,null,null,null,null,null,null,null,null," "," "]
[{"$f":"'Sınıf-Dönem-Sınav Seçim Sayfası'!F48","v":" "},{"$f":"IF('Sınıf-Dönem-Sınav Seçim Sayfası'!G48=0,\" \",'Sınıf-Dönem-Sınav Seçim Sayfası'!G48)","v":" "},{"$f":"IF('Sınıf-Dönem-Sınav Seçim Sayfası'!H48=0,\" \",'Sınıf-Dönem-Sınav Seçim Sayfası'!H48)","v":" "},null,null,null,null,null,null,null,null,null,null,null,null,null,null,null,null,null,null,null,null,null,null,null,null,null,null,null,null,null,null,null,null,null,null,null,null,null,null,null,null,null,null," "," "]
["SORULAR",null,null,null,null,{"$f":"F5","v":"1.SORU"},"2.SORU","3.SORU","4.SORU","5.SORU","6.SORU","7.SORU","8.SORU","9.SORU","10.SORU"," "," "," "," "," "," "," "," "," "," "," "," "," "," "," "," "," "," "," "," "," "," "," "," "," "," "," "," "," "," "]
["SORULARIN TOPLAM PUANI",null,null,null,null,{"$f":"IF(COUNTBLANK(F6:F50)=ROWS(F6:F50),\" \",SUM(F6:F50))","v":20},20,20,20,20,20,20,20,20,20," "," "," "," "," "," "," "," "," "," "," "," "," "," "," "," "," "," "," "," "," "," "," "," "," "," "," "," "," "," "]
["SORULARDAN ALINAN PUANLARIN ARİTMETİK ORTALAMASI",null,null,null,null,{"$f":"IF(COUNTBLANK(F6:F50)=ROWS(F6:F50),\" \",AVERAGE(F6:F50))","v":10},10,10,10,10,10,10,10,10,10," "," "," "," "," "," "," "," "," "," "," "," "," "," "," "," "," "," "," "," "," "," "," "," "," "," "," "," "," "," ",{"$f":"IF(COUNTIF(AT6:AT50,\" \")=ROWS(AT6:AT50),\" \",AVERAGE(AT6:AT50))","v":100}]
["SORULARDAN TAM PUAN \nALANLARIN SAYISI",null,null,null,null,{"$f":"IF(COUNTBLANK(F6:F50)=ROWS(F6:F50),\" \",IF(COUNTIF(F6:F50,F4)=0,\"YOK\",COUNTIF(F6:F50,F4)))","v":2},2,2,2,2,2,2,2,2,2," "," "," "," "," "," "," "," "," "," "," "," "," "," "," "," "," "," "," "," "," "," "," "," "," "," "," "," "," "," "]
["SORULARDAN TAM PUAN \nALANLARIN YÜZDESİ",null,null,null,null,{"$f":"IF(COUNTBLANK(F6:F50)=ROWS(F6:F50),\" \",IF(F54=\"YOK\",0,100*F54/COUNTA(F6:F50)))","v":100},100,100,100,100,100,100,100,100,100," "," "," "," "," "," "," "," "," "," "," "," "," "," "," "," "," "," "," "," "," "," "," "," "," "," "," "," "," "," "]
[null,null,null,null,null,{"$f":"IF(F55<>\" \",\"%\",\" \")","v":"%"},{"$f":"IF(G55<>\" \",\"%\",\" \")","v":"%"},"%","%","%","%","%","%","%","%"," "," "," "," "," "," "," "," "," "," "," "," "," "," "," "," "," "," "," "," "," "," "," "," "," "," "," "," "," "," "]
["SORULARDAN SIFIR PUAN \nALANLARIN SAYISI",null,null,null,null,{"$f":"IF(COUNTBLANK(F6:F50)=ROWS(F6:F50),\" \",IF(COUNTIF(F6:F50,0)=0,\"YOK\",COUNTIF(F6:F50,0)))","v":"YOK"},"YOK","YOK","YOK","YOK","YOK","YOK","YOK","YOK","YOK"," "," "," "," "," "," "," "," "," "," "," "," "," "," "," "," "," "," "," "," "," "," "," "," "," "," "," "," "," "," "]
["SORULARDAN SIFIR PUAN \nALANLARIN YÜZDESİ",null,null,null,null,{"$f":"IF(COUNTBLANK(F6:F50)=ROWS(F6:F50),\" \",IF(F57=\"YOK\",0,100*F57/COUNTA(F6:F50)))","v":0},0,0,0,0,0,0,0,0,0," "," "," "," "," "," "," "," "," "," "," "," "," "," "," "," "," "," "," "," "," "," "," "," "," "," "," "," "," "," "]
[null,null,null,null,null,{"$f":"IF(F58<>\" \",\"%\",\" \")","v":"%"},{"$f":"IF(G58<>\" \",\"%\",\" \")","v":"%"},"%","%","%","%","%","%","%","%"," "," "," "," "," "," "," "," "," "," "," "," "," "," "," "," "," "," "," "," "," "," "," "," "," "," "," "," "," "," "]
["SORULARIN YÜZDELİK DEĞERİ",null,null,null,null,{"$f":"IF(F4=\" \",\" \",IF(COUNTBLANK(F6:F50)=ROWS(F6:F50),\" \",F53*100/F4))","v":100},100,100,100,100,100,100,100,100,100," "," "," "," "," "," "," "," "," "," "," "," "," "," "," "," "," "," "," "," "," "," "," "," "," "," "," "," "," "," "]
[null,null,null,null,null,{"$f":"IF(F60<>\" \",\"%\",\" \")","v":"%"},{"$f":"IF(G60<>\" \",\"%\",\" \")","v":"%"},"%","%","%","%","%","%","%","%"," "," "," "," "," "," "," "," "," "," "," "," "," "," "," "," "," "," "," "," "," "," "," "," "," "," "," "," "," "," "]
[]
[]
[{"$f":"A1","v":"2017-2018 EĞİTİM ÖĞRETİM YILI FATİH SULTAN MEHMET ORTAOKULU"}]
[]
[{"$f":"'Sınıf-Dönem-Sınav Seçim Sayfası'!J3&\" SINIFI \"&'Temel Bilgiler'!H8&\" DERSİ \"&'Sınıf-Dönem-Sınav Seçim Sayfası'!L3","v":"8-A SINIFI MATEMATİK DERSİ II.DÖNEM"}]
[]
[null,null,null,null,null,null,null,null,null,null,null,null,null,null,null,{"$f":"'Sınıf-Dönem-Sınav Seçim Sayfası'!M3&\" ANALİZİ\"","v":"I.SINAV ANALİZİ"}]
[null,null,null,null,null,null,null,null,null,null,null,null,null,null,null,null,null,null,null,null,null,null,null,null,null,null,null,null,null,null,null,null,null,null,null,null,null,null,null,null,"SINAV TARİHİ",null,null,null,null,{"$f":"AT2","v":"00:00:00"}]
[null,null,null,null,null,null,{"$f":"A2","v":"8-A SINIFI MATEMATİK DERSİ II.DÖNEM  I.SINAV ANALİZİ"}]
[null,null,null,null,null,null,null,null,null,null,null,null,null,null,null,null,null,null,null,null,null,null,null,null,null,null,null,null,null,null,null,null,null,null,null,null,null,null,null,null,"ÇIKTI TARİHİ",null,null,null,null,{"$f":"TODAY()","v":"2018-03-29"}]
[]
["SINAVA KATILAN ÖĞRENCİ SAYISI",null,null,null,{"$f":"IF(SUM(W83:W87)=0,\" \",SUM(W83:W87))","v":2},null,null,null,null,null,null,"SINIF MEVCUDU",null,null,null,null,null,null,null,{"$f":"COUNTIF(B6:B50, \">0\")","v":2},null,null,null,null,null,null,null,null,null,null,null,null,null,null,null,null,null,null,null,null,{"$f":"'Sınıf-Dönem-Sınav Seçim Sayfası'!L3","v":"II.DÖNEM"},null,null,null,null,{"$f":"'Sınıf-Dönem-Sınav Seçim Sayfası'!K3","v":"2017-2018"},{"$f":"'Sınıf-Dönem-Sınav Seçim Sayfası'!J3","v":"8-A"}]
[]
["BAŞARILI ÖĞRENCİ SAYISI",null,null,null,{"$f":"IF(COUNTIF(AT6:AT50,\" \")=ROWS(AT6:AT50),\" \",SUM(W84:W87))","v":2},"%",{"$f":"IF(E75=\" \",\" \",100*E75/E73)","v":100},null,null,null,null,"BAŞARISIZ ÖĞRENCİ SAYISI",null,null,null,null,null,null,null,null,null,null,null,{"$f":"IF(COUNTIF(AT6:AT50,\" \")=ROWS(AT6:AT50),\" \",SUM(W83:W83))","v":0},null,"%",{"$f":"IF(X75=\" \",\" \",100*X75/E73)","v":0}]
[]
[]
["SINIF NOT ORTALAMASI",null,null,null,{"$f":"AT53","v":100},null,null,null,null,null,null,"EN YÜKSEK PUAN",null,null,null,null,null,null,null,{"$f":"IF(COUNTIF(AT6:AT50,\" \")=ROWS(AT6:AT50),\" \",LARGE(AT6:AT50,1))","v":100},null,null,null,null,null,null,null,"EN DÜŞÜK PUAN",null,null,null,null,null,null,null,{"$f":"IF(COUNTIF(AT6:AT50,\" \")=ROWS(AT6:AT50),\" \",SMALL(AT6:AT50,1))","v":100}]
[]
[]
[]
[{"$f":"G75","v":100},"BAŞARILI",null,null,null,null,null,null,null,null,null,null,null,null,null,null,"1. SINAV NOT DAĞILIM ÇİZELGESİ"]
[{"$f":"AA75","v":0},"BAŞARISIZ",null,null,null,null,null,null,null,null,null,null,null,null,null,null,1,null,null,"GEÇMEZ",null,null,{"$f":"IF(COUNTIF(AU6:AU50,\" \")=ROWS(AU6:AU50),\" \",COUNTIF(AU6:AU50,\"Geçmez\"))","v":0},{"$f":"IF(F141<>\" \",\"ÖĞRENCİ\",\" \")","v":"ÖĞRENCİ"},null,null,null,{"$f":"IF(F137=\" \",\" \",\"%\")","v":"%"},null,{"$f":"IF(W83=\" \",\" \",100*W83/W88)","v":0}]
[null,null,null,null,null,null,null,null,null,null,null,null,null,null,null,null,2,null,null,"GEÇER",null,null,{"$f":"IF(COUNTIF(AU6:AU50,\" \")=ROWS(AU6:AU50),\" \",COUNTIF(AU6:AU50,\"Geçer\"))","v":0},{"$f":"IF(F142<>\" \",\"ÖĞRENCİ\",\" \")","v":"ÖĞRENCİ"},null,null,null,{"$f":"IF(F138=\" \",\" \",\"%\")","v":"%"},null,{"$f":"IF(W84=\" \",\" \",100*W84/W88)","v":0}]
[null,null,null,null,null,null,null,null,null,null,null,null,null,null,null,null,3,null,null,"ORTA",null,null,{"$f":"IF(COUNTIF(AU6:AU50,\" \")=ROWS(AU6:AU50),\" \",COUNTIF(AU6:AU50,\"Orta\"))","v":0},{"$f":"IF(E99<>\" \",\"ÖĞRENCİ\",\" \")","v":"ÖĞRENCİ"},null,null,null,{"$f":"IF(F139=\" \",\" \",\"%\")","v":"%"},null,{"$f":"IF(W85=\" \",\" \",100*W85/W88)","v":0}]
[null,null,null,null,null,null,null,null,null,null,null,null,null,null,null,null,4,null,null,"İYİ",null,null,{"$f":"IF(COUNTIF(AU6:AU50,\" \")=ROWS(AU6:AU50),\" \",COUNTIF(AU6:AU50,\"İyi\"))","v":0},"ÖĞRENCİ",null,null,null,{"$f":"IF(F140=\" \",\" \",\"%\")","v":"%"},null,{"$f":"IF(W86=\" \",\" \",100*W86/W88)","v":0}]
[null,null,null,null,null,null,null,null,null,null,null,null,null,null,null,null,5,null,null,"PEKİYİ",null,null,{"$f":"IF(COUNTIF(AU6:AU50,\" \")=ROWS(AU6:AU50),\" \",COUNTIF(AU6:AU50,\"Pekiyi\"))","v":2},"ÖĞRENCİ",null,null,null,{"$f":"IF(F141=\" \",\" \",\"%\")","v":"%"},null,{"$f":"IF(W87=\" \",\" \",100*W87/W88)","v":100}]
[null,null,null,null,null,null,null,null,null,null,null,null,null,null,null,null,"TOPLAM",null,null,null,null,null,{"$f":"IF(SUM(W83:W87)=0,\" \",SUM(W83:W87))","v":2},"ÖĞRENCİ"]
[]
[]
[]
[]
[]
[]
[]
[]
[]
[]
[]
[]
[]
[]
[]
[]
[]
[]
[]
[]
["DEĞERLENDİRME",null,null,"Yapılan analize göre sınıfın başarı oranı %",null,null,null,null,null,null,null,null,null,null,null,null,{"$f":"G75","v":100},null,"dır. ",null,"Yapılan sınavda ",null,null,null,null,null,{"$f":"E75","v":2},null,"öğrenci başarılı",null,null,null,null,null,{"$f":"X75","v":0},null,"öğrenci başarısız olmuştur."]
[null,null,null,"Sınavda başarısız olan öğrenciler için zorlandıkları konular tekrar edilecek ve daha fazla örnek çözülecektir."]
[]
[]
[]
[]
[]
[]
[]
[]
[]
[null,null,null,{"$f":"'Temel Bilgiler'!H10","v":"Kerime YUVAKLIGİL"}]
[null,null,{"$f":"'Temel Bilgiler'!H12&\" Öğretmeni\"","v":"Matematik Öğretmeni"}]

{"sheet":"E-OKULA PUAN AKTAR","index":6,"n_rows":47,"n_cols":5,"rows_kept":47,"cut":false,"hidden":false,"merged":[[34,2,34,3],[35,2,35,3],[36,2,36,3],[30,2,30,3],[27,2,27,3],[28,2,28,3],[0,0,1,0],[0,1,0,4],[31,2,31,3],[32,2,32,3],[33,2,33,3],[19,2,19,3],[20,2,20,3],[21,2,21,3],[22,2,22,3],[23,2,23,3],[29,2,29,3],[24,2,24,3],[25,2,25,3],[26,2,26,3],[18,2,18,3],[7,2,7,3],[47,2,47,3],[37,2,37,3],[38,2,38,3],[39,2,39,3],[40,2,40,3],[41,2,41,3],[46,2,46,3],[42,2,42,3],[43,2,43,3],[44,2,44,3],[45,2,45,3],[8,2,8,3],[9,2,9,3],[10,2,10,3],[11,2,11,3],[12,2,12,3],[13,2,13,3],[14,2,14,3],[15,2,15,3],[16,2,16,3],[17,2,17,3],[6,2,6,3],[1,2,1,3],[2,2,2,3],[3,2,3,3],[4,2,4,3],[5,2,5,3]]}
["MEVCUT",{"$f":"'Sınıf-Dönem-Sınav Seçim Sayfası'!J3& \" SINIFI \"&\"  \" &'Sınıf-Dönem-Sınav Seçim Sayfası'!M3","v":"8-A SINIFI   I.SINAV"}]
[null,"Ö.NO","AD SOYAD",null,"PUAN"]
[1,{"$f":"Analiz!B6","v":1301},{"$f":"Analiz!C6","v":"Hüseyin BAY"},null,{"$f":"Analiz!AT6","v":100}]
[2,{"$f":"Analiz!B7","v":1305},{"$f":"Analiz!C7","v":"Ahmet KESKİN"},null,{"$f":"Analiz!AT7","v":100}]
[3,{"$f":"Analiz!B8","v":"…"},{"$f":"Analiz!C8","v":"…"},null,{"$f":"Analiz!AT8","v":" "}]
[4,{"$f":"Analiz!B9","v":"…"},{"$f":"Analiz!C9","v":"…"},null,{"$f":"Analiz!AT9","v":" "}]
[5,{"$f":"Analiz!B10","v":" "},{"$f":"Analiz!C10","v":" "},null,{"$f":"Analiz!AT10","v":" "}]
[6,{"$f":"Analiz!B11","v":" "},{"$f":"Analiz!C11","v":" "},null,{"$f":"Analiz!AT11","v":" "}]
[7,{"$f":"Analiz!B12","v":" "},{"$f":"Analiz!C12","v":" "},null,{"$f":"Analiz!AT12","v":" "}]
[8,{"$f":"Analiz!B13","v":" "},{"$f":"Analiz!C13","v":" "},null,{"$f":"Analiz!AT13","v":" "}]
[9,{"$f":"Analiz!B14","v":" "},{"$f":"Analiz!C14","v":" "},null,{"$f":"Analiz!AT14","v":" "}]
[10,{"$f":"Analiz!B15","v":" "},{"$f":"Analiz!C15","v":" "},null,{"$f":"Analiz!AT15","v":" "}]
[11,{"$f":"Analiz!B16","v":" "},{"$f":"Analiz!C16","v":" "},null,{"$f":"Analiz!AT16","v":" "}]
[12,{"$f":"Analiz!B17","v":" "},{"$f":"Analiz!C17","v":" "},null,{"$f":"Analiz!AT17","v":" "}]
[13,{"$f":"Analiz!B18","v":" "},{"$f":"Analiz!C18","v":" "},null,{"$f":"Analiz!AT18","v":" "}]
[14,{"$f":"Analiz!B19","v":" "},{"$f":"Analiz!C19","v":" "},null,{"$f":"Analiz!AT19","v":" "}]
[15,{"$f":"Analiz!B20","v":" "},{"$f":"Analiz!C20","v":" "},null,{"$f":"Analiz!AT20","v":" "}]
[16,{"$f":"Analiz!B21","v":" "},{"$f":"Analiz!C21","v":" "},null,{"$f":"Analiz!AT21","v":" "}]
[17,{"$f":"Analiz!B22","v":" "},{"$f":"Analiz!C22","v":" "},null,{"$f":"Analiz!AT22","v":" "}]
[18,{"$f":"Analiz!B23","v":" "},{"$f":"Analiz!C23","v":" "},null,{"$f":"Analiz!AT23","v":" "}]
[19,{"$f":"Analiz!B24","v":" "},{"$f":"Analiz!C24","v":" "},null,{"$f":"Analiz!AT24","v":" "}]
[20,{"$f":"Analiz!B25","v":" "},{"$f":"Analiz!C25","v":" "},null,{"$f":"Analiz!AT25","v":" "}]
[21,{"$f":"Analiz!B26","v":" "},{"$f":"Analiz!C26","v":" "},null,{"$f":"Analiz!AT26","v":" "}]
[22,{"$f":"Analiz!B27","v":" "},{"$f":"Analiz!C27","v":" "},null,{"$f":"Analiz!AT27","v":" "}]
[23,{"$f":"Analiz!B28","v":" "},{"$f":"Analiz!C28","v":" "},null,{"$f":"Analiz!AT28","v":" "}]
[24,{"$f":"Analiz!B29","v":" "},{"$f":"Analiz!C29","v":" "},null,{"$f":"Analiz!AT29","v":" "}]
[25,{"$f":"Analiz!B30","v":" "},{"$f":"Analiz!C30","v":" "},null,{"$f":"Analiz!AT30","v":" "}]
[26,{"$f":"Analiz!B31","v":" "},{"$f":"Analiz!C31","v":" "},null,{"$f":"Analiz!AT31","v":" "}]
[27,{"$f":"Analiz!B32","v":" "},{"$f":"Analiz!C32","v":" "},null,{"$f":"Analiz!AT32","v":" "}]
[28,{"$f":"Analiz!B33","v":" "},{"$f":"Analiz!C33","v":" "},null,{"$f":"Analiz!AT33","v":" "}]
[29,{"$f":"Analiz!B34","v":" "},{"$f":"Analiz!C34","v":" "},null,{"$f":"Analiz!AT34","v":" "}]
[30,{"$f":"Analiz!B35","v":" "},{"$f":"Analiz!C35","v":" "},null,{"$f":"Analiz!AT35","v":" "}]
[31,{"$f":"Analiz!B36","v":" "},{"$f":"Analiz!C36","v":" "},null,{"$f":"Analiz!AT36","v":" "}]
[32,{"$f":"Analiz!B37","v":" "},{"$f":"Analiz!C37","v":" "},null,{"$f":"Analiz!AT37","v":" "}]
[33,{"$f":"Analiz!B38","v":" "},{"$f":"Analiz!C38","v":" "},null,{"$f":"Analiz!AT38","v":" "}]
[34,{"$f":"Analiz!B39","v":" "},{"$f":"Analiz!C39","v":" "},null,{"$f":"Analiz!AT39","v":" "}]
[35,{"$f":"Analiz!B40","v":" "},{"$f":"Analiz!C40","v":" "},null,{"$f":"Analiz!AT40","v":" "}]
[36,{"$f":"Analiz!B41","v":" "},{"$f":"Analiz!C41","v":" "},null,{"$f":"Analiz!AT41","v":" "}]
[37,{"$f":"Analiz!B42","v":" "},{"$f":"Analiz!C42","v":" "},null,{"$f":"Analiz!AT42","v":" "}]
[38,{"$f":"Analiz!B43","v":" "},{"$f":"Analiz!C43","v":" "},null,{"$f":"Analiz!AT43","v":" "}]
[39,{"$f":"Analiz!B44","v":" "},{"$f":"Analiz!C44","v":" "},null,{"$f":"Analiz!AT44","v":" "}]
[40,{"$f":"Analiz!B45","v":" "},{"$f":"Analiz!C45","v":" "},null,{"$f":"Analiz!AT45","v":" "}]
[41,{"$f":"Analiz!B46","v":" "},{"$f":"Analiz!C46","v":" "},null,{"$f":"Analiz!AT46","v":" "}]
[42,{"$f":"Analiz!B47","v":" "},{"$f":"Analiz!C47","v":" "},null,{"$f":"Analiz!AT47","v":" "}]
[43,{"$f":"Analiz!B48","v":" "},{"$f":"Analiz!C48","v":" "},null,{"$f":"Analiz!AT48","v":" "}]
[44,{"$f":"Analiz!B49","v":" "},{"$f":"Analiz!C49","v":" "},null,{"$f":"Analiz!AT49","v":" "}]
[45,{"$f":"Analiz!B50","v":" "},{"$f":"Analiz!C50","v":" "},null,{"$f":"Analiz!AT50","v":" "}]

{"sheet":"Yıl-Dönem-Sınav No Liste","index":7,"n_rows":18,"n_cols":6,"rows_kept":18,"cut":false,"hidden":false,"merged":[]}
[]
[null,"Sene","Dönem","Sınavlar","Okul Türü","Grup Adı"]
[null,"2016-2017","I.DÖNEM","I.SINAV","Lise","A"]
[null,"2017-2018","II.DÖNEM","II.SINAV","Ortaokul","B"]
[null,"2018-2019",null,"III.SINAV"]
[null,"2019-2020",null,"I.PERFORMANS (ÖDEV)"]
[null,null,null,"II.PERFORMANS (ÖDEV)"]
[null,null,null,"I.DERS İÇİ PERFORMANS"]
[null,null,null,"II.DERS İÇİ PERFORMANS"]
[null,null,null,"PROJE"]
[null,null,null,"TELAFİ SINAVI"]
[null,null,null,"I.TELAFİ SINAVI"]
[null,null,null,"II.TELAFİ SINAVI"]
[null,null,null,"III.TELAFİ SINAVI"]
[null,null,null,"TEKAR SINAVI"]
[null,null,null,"I.TEKRAR SINAVI"]
[null,null,null,"II.TEKRAR SINAVI"]
[null,null,null,"III.TEKRAR SINAVI"]

{"sheet":"KULLANIM REHBERİ","index":8,"n_rows":0,"n_cols":0,"rows_kept":0,"cut":false,"hidden":false,"merged":[]}