{"text_format":"1","workbook":"xlsx","n_sheets":9,"sheets":["Ana Sayfa","Temel Bilgiler","Sınıflarınız","Sınıf-Dönem-Sınav Seçim Sayfası","NOT Baremi","Analiz","E-OKULA PUAN AKTAR","Yıl-Dönem-Sınav No Liste","KULLANIM REHBERİ"],"not_rendered":{"charts":3,"images":18,"macros":1,"external_links":1,"defined_names":50,"comments":3,"pivot_tables":0},"unopened":[],"bounds":{"document_bytes":16777216,"sheet_cells":100000,"rows_first":2000,"rows_last":500,"rows_between":2000,"halvings":0,"cell_chars":16384,"cell_head_chars":4096},"cells_cut":0,"cells_raw":0,"read":"whole","date_system":"1900"}

{"sheet":"Ana Sayfa","index":0,"n_rows":0,"n_cols":0,"rows_kept":0,"cut":false,"hidden":false,"merged":[]}

{"sheet":"Temel Bilgiler","index":1,"n_rows":14,"n_cols":8,"rows_kept":14,"cut":false,"hidden":false,"merged":[[13,4,14,6],[13,7,14,11],[9,7,10,11],[11,4,12,6],[11,7,12,11],[9,4,10,6],[1,4,3,11],[5,7,6,11],[7,7,8,11],[5,4,6,6],[7,4,8,6]]}
[]
[null,null,null,null,"TEMEL BİLGİLER"]
[]
[]
[]
[null,null,null,null,"OKULUN ADI",null,null,"FATİH SULTAN MEHMET ORTAOKULU"]
[]
[null,null,null,null,"DERSİN ADI",null,null,"MATEMATİK"]
[]
[null,null,null,null,"DERSİN ÖĞRETMENİ",null,null,"Kerime YUVAKLIGİL"]
[]
[null,null,null,null,"BRANŞI",null,null,"Matematik"]
[]
[null,null,null,null,"OKUL TÜRÜ",null,null,"Ortaokul"]

{"sheet":"Sınıflarınız","index":2,"n_rows":991,"n_cols":8,"rows_kept":991,"cut":false,"hidden":false,"merged":[[0,3,44,3],[46,3,91,3],[93,3,138,3],[140,3,185,3],[187,3,232,3],[234,3,279,3],[281,3,326,3],[328,3,373,3],[375,3,420,3],[422,3,467,3],[516,3,561,3],[563,3,608,3],[610,3,655,3],[657,3,702,3],[469,3,514,3]]}
[1,1301,"Hüseyin BAY",{"$f":"G4","v":"8-A"}]
[2,1305,"Ahmet KESKİN"]
[3,"…","…",null,null,"S.No","Sınıf İsmi"]
[4,"…","…",null,null,1,"8-A",1]
[5,null,null,null,null,2,"8-B",47]
[6,null,null,null,null,3,"…",94]
[7,null,null,null,null,4,"…",141]
[8,null,null,null,null,5,"…",188]
[9,null,null,null,null,6,null,235]
[10,null,null,null,null,7,null,282]
[11,null,null,null,null,8,null,329]
[12,null,null,null,null,9,null,376]
[13,null,null,null,null,10,null,423]
[14,null,null,null,null,11,null,470]
[15,null,null,null,null,12,null,517]
{"$rows_left_out":977}
{"sheet":"Sınıf-Dönem-Sınav Seçim Sayfası","index":3,"n_rows":48,"n_cols":13,"rows_kept":48,"cut":false,"hidden":false,"merged":[[1,5,1,7]]}
[]
[null,null,null,null,null,"SINIF LİSTESİ",null,null,null,"SINIF SEÇ","EĞT.-ÖĞRT.    YILI SEÇ","DÖNEM SEÇ","SINAV SEÇ"]
[null,null,null,null,null,"SIRA \nNO","ÖĞRENCİ NO","ADI ve SOYADI",null,"8-A","2017-2018","II.DÖNEM","I.SINAV"]
[null,null,null,null,{"$f":"VLOOKUP(J3,Sınıflarınız!$G$4:$H$31,2,0)","v":1},{"$f":"IF(G4>0,1,\" \")","v":1},{"$f":"IF(E4<>\"\",VLOOKUP($E4,Sınıflarınız!A:C,2),\"\")","v":1301},{"$f":"IF(G4<>\"\",VLOOKUP($E4,Sınıflarınız!A:C,3),\"\")","v":"Hüseyin BAY"}]
[null,null,null,null,{"$f":"E4+1","v":2},{"$f":"IF(G5>0,F4+1,\" \")","v":2},{"$f":"IF(E5<>\"\",VLOOKUP($E5,Sınıflarınız!A:C,2),\"\")","v":1305},{"$f":"IF(G5<>\"\",VLOOKUP($E5,Sınıflarınız!A:C,3),\"\")","v":"Ahmet KESKİN"}]
[null,null,null,null,{"$f":"E5+1","v":3},{"$f":"IF(G6>0,F5+1,\" \")","v":3},{"$f":"IF(E6<>\"\",VLOOKUP($E6,Sınıflarınız!A:C,2),\"\")","v":"…"},{"$f":"IF(G6<>\"\",VLOOKUP($E6,Sınıflarınız!A:C,3),\"\")","v":"…"}]
[null,null,null,null,{"$f":"E6+1","v":4},4,{"$f":"IF(E7<>\"\",VLOOKUP($E7,Sınıflarınız!A:C,2),\"\")","v":"…"},{"$f":"IF(G7<>\"\",VLOOKUP($E7,Sınıflarınız!A:C,3),\"\")","v":"…"}]
[null,null,null,null,5," ",{"$f":"IF(E8<>\"\",VLOOKUP($E8,Sınıflarınız!A:C,2),\"\")","v":0},{"$f":"IF(G8<>\"\",VLOOKUP($E8,Sınıflarınız!A:C,3),\"\")","v":0}]
[null,null,null,null,6," ",{"$f":"IF(E9<>\"\",VLOOKUP($E9,Sınıflarınız!A:C,2),\"\")","v":0},{"$f":"IF(G9<>\"\",VLOOKUP($E9,Sınıflarınız!A:C,3),\"\")","v":0}]
[null,null,null,null,7," ",{"$f":"IF(E10<>\"\",VLOOKUP($E10,Sınıflarınız!A:C,2),\"\")","v":0},{"$f":"IF(G10<>\"\",VLOOKUP($E10,Sınıflarınız!A:C,3),\"\")","v":0}]
[null,null,null,null,8," ",{"$f":"IF(E11<>\"\",VLOOKUP($E11,Sınıflarınız!A:C,2),\"\")","v":0},{"$f":"IF(G11<>\"\",VLOOKUP($E11,Sınıflarınız!A:C,3),\"\")","v":0}]
[null,null,null,null,9," ",{"$f":"IF(E12<>\"\",VLOOKUP($E12,Sınıflarınız!A:C,2),\"\")","v":0},{"$f":"IF(G12<>\"\",VLOOKUP($E12,Sınıflarınız!A:C,3),\"\")","v":0}]
[null,null,null,null,10," ",{"$f":"IF(E13<>\"\",VLOOKUP($E13,Sınıflarınız!A:C,2),\"\")","v":0},{"$f":"IF(G13<>\"\",VLOOKUP($E13,Sınıflarınız!A:C,3),\"\")","v":0}]
[null,null,null,null,11," ",{"$f":"IF(E14<>\"\",VLOOKUP($E14,Sınıflarınız!A:C,2),\"\")","v":0},{"$f":"IF(G14<>\"\",VLOOKUP($E14,Sınıflarınız!A:C,3),\"\")","v":0}]
[null,null,null,null,12," ",{"$f":"IF(E15<>\"\",VLOOKUP($E15,Sınıflarınız!A:C,2),\"\")","v":0},{"$f":"IF(G15<>\"\",VLOOKUP($E15,Sınıflarınız!A:C,3),\"\")","v":0}]
{"$rows_left_out":34}
{"sheet":"NOT Baremi","index":4,"n_rows":9,"n_cols":45,"rows_kept":9,"cut":false,"hidden":false,"merged":[[0,1,1,36],[8,1,8,3],[7,1,7,3],[5,44,7,44],[2,1,3,44],[5,1,6,43]]}
[null,"NOT BAREMİ"]
[]
[]
[]
[]
[null,"SINAVDAKİ SORULARIN PUAN DEĞERLERİ",null,null,null,null,null,null,null,null,null,null,null,null,null,null,null,null,null,null,null,null,null,null,null,null,null,null,null,null,null,null,null,null,null,null,null,null,null,null,null,null,null,null,"TOPLAM PUAN"]
[]
[null,"SORU NO",null,null,1,2,3,4,5,6,7,8,9,10,11,12,13,14,15,16,17,18,19,20,21,22,23,24,25,26,27,28,29,30,31,32,33,34,35,36,37,38,39,40]
[null,"PUAN DEĞERİ",null,null,10,10,10,10,10,10,10,10,10,10,null,null,null,null,null,null,null,null,null,null,null,null,null,null,null,null,null,null,null,null,null,null,null,null,null,null,null,null,null,null,{"$f":"IF(SUM(E9:AR9)=0,\" \",IF(SUM(E9:AR9)>100,\"HATA\",SUM(E9:AR9)))","v":100}]

{"sheet":"Analiz","index":5,"n_rows":121,"n_cols":48,"rows_kept":121,"cut":false,"hidden":false,"merged":[[45,2,45,4],[46,2,46,4],[47,2,47,4],[48,2,48,4],[86,23,86,26],[85,23,85,26],[82,16,82,18],[83,16,83,18],[84,16,84,18],[84,23,84,26],[83,23,83,26],[85,16,85,18],[86,16,86,18],[83,19,83,21],[84,19,84,21],[85,19,85,21],[86,19,86,21],[74,6,75,7],[74,11,75,22],[77,4,78,6],[65,0,66,46],[67,15,67,30],[68,45,69,46],[68,40,69,44],[135,1,141,11],[119,3,119,12],[119,32,119,44],[90,32,90,46],[104,42,104,46],[100,12,100,30],[102,32,102,40],[103,32,103,40],[93,31,93,39],[102,42,102,46],[103,42,103,46],[108,16,108,17],[108,26,108,27],[108,34,108,35],[108,0,115,2],[120,2,120,15],[105,32,106,40],[105,42,105,46],[106,42,106,46],[104,32,104,40],[90,11,90,31],[100,4,100,10],[101,4,101,10],[102,4,102,10],[72,40,72,44],[82,23,82,26],[70,45,71,46],[82,19,82,21],[77,11,78,18],[77,19,78,20],[74,8,75,10],[81,16,81,31],[74,28,75,46],[77,35,78,36],[69,6,70,38],[81,32,81,33],[70,40,71,44],[82,29,82,31],[82,27,82,28],[74,23,75,24],[74,25,75,25],[74,26,75,27],[2,0,2,4],[2,45,2,46],[57,0,58,4],[59,0,60,4],[50,0,50,4],[52,0,52,4],[51,0,51,4],[53,0,53,4],[54,46,55,46],[54,0,55,4],[10,2,10,4],[19,2,19,4],[20,2,20,4],[18,2,18,4],[14,2,14,4],[57,45,58,45],[57,46,58,46],[59,45,60,45],[59,46,60,46],[43,2,43,4],[23,2,23,4],[8,2,8,4],[5,2,5,4],[6,2,6,4],[72,0,72,3],[74,0,75,3],[74,4,75,4],[74,5,75,5],[77,7,78,10],[77,27,78,34],[72,19,72,20],[72,11,72,18],[87,16,87,21],[87,23,87,26],[84,27,84,28],[85,27,85,28],[86,27,86,28],[83,29,83,31],[84,29,84,31],[85,29,85,31],[86,29,86,31],[83,27,83,28],[7,2,7,4],[163,16,163,18],[163,8,163,11],[163,13,163,14],[162,8,162,11],[162,13,162,14],[21,2,21,4],[22,2,22,4],[37,2,37,4],[32,2,32,4],[31,2,31,4],[38,2,38,4],[35,2,35,4],[36,2,36,4],[44,2,44,4],[49,2,49,4],[34,2,34,4],[39,2,39,4],[40,2,40,4],[41,2,41,4],[42,2,42,4],[162,16,162,18],[77,0,78,3],[63,0,64,46],[0,45,0,46],[1,45,1,46],[0,0,0,44],[1,0,1,44],[15,2,15,4],[9,2,9,4],[56,0,56,4],[3,46,4,46],[54,45,55,45],[33,2,33,4],[28,2,28,4],[29,2,29,4],[11,2,11,4],[16,2,16,4],[17,2,17,4],[13,2,13,4],[26,2,26,4],[24,2,24,4],[30,2,30,4],[27,2,27,4],[3,0,3,4],[4,2,4,4],[12,2,12,4],[25,2,25,4]]}
[{"$f":"'Sınıf-Dönem-Sınav Seçim Sayfası'!K3&\" EĞİTİM ÖĞRETİM YILI \"&'Temel Bilgiler'!H6","v":"2017-2018 EĞİTİM ÖĞRETİM YILI FATİH SULTAN MEHMET ORTAOKULU"},null,null,null,null,null,null,null,null,null,null,null,null,null,null,null,null,null,null,null,null,null,null,null,null,null,null,null,null,null,null,null,null,null,null,null,null,null,null,null,null,null,null,null,null,"Sınav Tarihi"]
[{"$f":"'Sınıf-Dönem-Sınav Seçim Sayfası'!J3&\" SINIFI \"&'Temel Bilgiler'!H8&\" DERSİ \"&'Sınıf-Dönem-Sınav Seçim Sayfası'!L3&\"  \"& 'Sınıf-Dönem-Sınav Seçim Sayfası'!M3& \" ANALİZİ\"","v":"8-A SINIFI MATEMATİK DERSİ II.DÖNEM  I.SINAV ANALİZİ"}]
["SORUNUN KONUSU",null,null,null,null,"Üçgende açılar","Yamuk alan hesabı","Özel üçgenler","Trigonometri","Paralel kenar","Çemberde açı","Deltoid","Piramitler","Küre","Vektörler",null,null,null,null,null,null,null,null,null,null,null,null,null,null,null,null,null,null,null,null,null,null,null,null,null,null,null,null,null,null,"İletişim: huseyin0207@hotmail.com"]
["SORULARIN PUAN DEĞERİ",null,null,null,null,{"$f":"IF('NOT Baremi'!E9=0,\" \",'NOT Baremi'!E9)","v":10},{"$f":"IF('NOT Baremi'!F9=0,\" \",'NOT Baremi'!F9)","v":10},{"$f":"IF('NOT Baremi'!G9=0,\" \",'NOT Baremi'!G9)","v":10},{"$f":"IF('NOT Baremi'!H9=0,\" \",'NOT Baremi'!H9)","v":10},{"$f":"IF('NOT Baremi'!I9=0,\" \",'NOT Baremi'!I9)","v":10},{"$f":"IF('NOT Baremi'!J9=0,\" \",'NOT Baremi'!J9)","v":10},{"$f":"IF('NOT Baremi'!K9=0,\" \",'NOT Baremi'!K9)","v":10},{"$f":"IF('NOT Baremi'!L9=0,\" \",'NOT Baremi'!L9)","v":10},{"$f":"IF('NOT Baremi'!M9=0,\" \",'NOT Baremi'!M9)","v":10},{"$f":"IF('NOT Baremi'!N9=0,\" \",'NOT Baremi'!N9)","v":10},{"$f":"IF('NOT Baremi'!O9=0,\" \",'NOT Baremi'!O9)","v":" "},{"$f":"IF('NOT Baremi'!P9=0,\" \",'NOT Baremi'!P9)","v":" "},{"$f":"IF('NOT Baremi'!Q9=0,\" \",'NOT Baremi'!Q9)","v":" "},{"$f":"IF('NOT Baremi'!R9=0,\" \",'NOT Baremi'!R9)","v":" "},{"$f":"IF('NOT Baremi'!S9=0,\" \",'NOT Baremi'!S9)","v":" "},{"$f":"IF('NOT Baremi'!T9=0,\" \",'NOT Baremi'!T9)","v":" "},{"$f":"IF('NOT Baremi'!U9=0,\" \",'NOT Baremi'!U9)","v":" "},{"$f":"IF('NOT Baremi'!V9=0,\" \",'NOT Baremi'!V9)","v":" "},{"$f":"IF('NOT Baremi'!W9=0,\" \",'NOT Baremi'!W9)","v":" "},{"$f":"IF('NOT Baremi'!X9=0,\" \",'NOT Baremi'!X9)","v":" "},{"$f":"IF('NOT Baremi'!Y9=0,\" \",'NOT Baremi'!Y9)","v":" "},{"$f":"IF('NOT Baremi'!Z9=0,\" \",'NOT Baremi'!Z9)","v":" "},{"$f":"IF('NOT Baremi'!AA9=0,\" \",'NOT Baremi'!AA9)","v":" "},{"$f":"IF('NOT Baremi'!AB9=0,\" \",'NOT Baremi'!AB9)","v":" "},{"$f":"IF('NOT Baremi'!AC9=0,\" \",'NOT Baremi'!AC9)","v":" "},{"$f":"IF('NOT Baremi'!AD9=0,\" \",'NOT Baremi'!AD9)","v":" "},{"$f":"IF('NOT Baremi'!AE9=0,\" \",'NOT Baremi'!AE9)","v":" "},{"$f":"IF('NOT Baremi'!AF9=0,\" \",'NOT Baremi'!AF9)","v":" "},{"$f":"IF('NOT Baremi'!AG9=0,\" \",'NOT Baremi'!AG9)","v":" "},{"$f":"IF('NOT Baremi'!AH9=0,\" \",'NOT Baremi'!AH9)","v":" "},{"$f":"IF('NOT Baremi'!AI9=0,\" \",'NOT Baremi'!AI9)","v":" "},{"$f":"IF('NOT Baremi'!AJ9=0,\" \",'NOT Baremi'!AJ9)","v":" "},{"$f":"IF('NOT Baremi'!AK9=0,\" \",'NOT Baremi'!AK9)","v":" "},{"$f":"IF('NOT Baremi'!AL9=0,\" \",'NOT Baremi'!AL9)","v":" "},{"$f":"IF('NOT Baremi'!AM9=0,\" \",'NOT Baremi'!AM9)","v":" "},{"$f":"IF('NOT Baremi'!AN9=0,\" \",'NOT Baremi'!AN9)","v":" "},{"$f":"IF('NOT Baremi'!AO9=0,\" \",'NOT Baremi'!AO9)","v":" "},{"$f":"IF('NOT Baremi'!AP9=0,\" \",'NOT Baremi'!AP9)","v":" "},{"$f":"IF('NOT Baremi'!AQ9=0,\" \",'NOT Baremi'!AQ9)","v":" "},{"$f":"IF('NOT Baremi'!AR9=0,\" \",'NOT Baremi'!AR9)","v":" "},{"$f":"IF(SUM(F4:AS4)=0,\" \",SUM(F4:AS4))","v":100},"Derece",{"$f":"IF('Temel Bilgiler'!H14=\"Lise\",1,0)","v":0}]
["SIRA NO","ÖĞR.NO","AD SOYAD",null,null,{"$f":"IF('NOT Baremi'!E9>0,'NOT Baremi'!E8&\".\"&\"SORU\",\" \")","v":"1.SORU"},{"$f":"IF('NOT Baremi'!F9>0,'NOT Baremi'!F8&\".\"&\"SORU\",\" \")","v":"2.SORU"},{"$f":"IF('NOT Baremi'!G9>0,'NOT Baremi'!G8&\".\"&\"SORU\",\" \")","v":"3.SORU"},{"$f":"IF('NOT Baremi'!H9>0,'NOT Baremi'!H8&\".\"&\"SORU\",\" \")","v":"4.SORU"},{"$f":"IF('NOT Baremi'!I9>0,'NOT Baremi'!I8&\".\"&\"SORU\",\" \")","v":"5.SORU"},{"$f":"IF('NOT Baremi'!J9>0,'NOT Baremi'!J8&\".\"&\"SORU\",\" \")","v":"6.SORU"},{"$f":"IF('NOT Baremi'!K9>0,'NOT Baremi'!K8&\".\"&\"SORU\",\" \")","v":"7.SORU"},{"$f":"IF('NOT Baremi'!L9>0,'NOT Baremi'!L8&\".\"&\"SORU\",\" \")","v":"8.SORU"},{"$f":"IF('NOT Baremi'!M9>0,'NOT Baremi'!M8&\".\"&\"SORU\",\" \")","v":"9.SORU"},{"$f":"IF('NOT Baremi'!N9>0,'NOT Baremi'!N8&\".\"&\"SORU\",\" \")","v":"10.SORU"},{"$f":"IF('NOT Baremi'!O9>0,'NOT Baremi'!O8&\".\"&\"SORU\",\" \")","v":" "},{"$f":"IF('NOT Baremi'!P9>0,'NOT Baremi'!P8&\".\"&\"SORU\",\" \")","v":" "},{"$f":"IF('NOT Baremi'!Q9>0,'NOT Baremi'!Q8&\".\"&\"SORU\",\" \")","v":" "},{"$f":"IF('NOT Baremi'!R9>0,'NOT Baremi'!R8&\".\"&\"SORU\",\" \")","v":" "},{"$f":"IF('NOT Baremi'!S9>0,'NOT Baremi'!S8&\".\"&\"SORU\",\" \")","v":" "},{"$f":"IF('NOT Baremi'!T9>0,'NOT Baremi'!T8&\".\"&\"SORU\",\" \")","v":" "},{"$f":"IF('NOT Baremi'!U9>0,'NOT Baremi'!U8&\".\"&\"SORU\",\" \")","v":" "},{"$f":"IF('NOT Baremi'!V9>0,'NOT Baremi'!V8&\".\"&\"SORU\",\" \")","v":" "},{"$f":"IF('NOT Baremi'!W9>0,'NOT Baremi'!W8&\".\"&\"SORU\",\" \")","v":" "},{"$f":"IF('NOT Baremi'!X9>0,'NOT Baremi'!X8&\".\"&\"SORU\",\" \")","v":" "},{"$f":"IF('NOT Baremi'!Y9>0,'NOT Baremi'!Y8&\".\"&\"SORU\",\" \")","v":" "},{"$f":"IF('NOT Baremi'!Z9>0,'NOT Baremi'!Z8&\".\"&\"SORU\",\" \")","v":" "},{"$f":"IF('NOT Baremi'!AA9>0,'NOT Baremi'!AA8&\".\"&\"SORU\",\" \")","v":" "},{"$f":"IF('NOT Baremi'!AB9>0,'NOT Baremi'!AB8&\".\"&\"SORU\",\" \")","v":" "},{"$f":"IF('NOT Baremi'!AC9>0,'NOT Baremi'!AC8&\".\"&\"SORU\",\" \")","v":" "},{"$f":"IF('NOT Baremi'!AD9>0,'NOT Baremi'!AD8&\".\"&\"SORU\",\" \")","v":" "},{"$f":"IF('NOT Baremi'!AE9>0,'NOT Baremi'!AE8&\".\"&\"SORU\",\" \")","v":" "},{"$f":"IF('NOT Baremi'!AF9>0,'NOT Baremi'!AF8&\".\"&\"SORU\",\" \")","v":" "},{"$f":"IF('NOT Baremi'!AG9>0,'NOT Baremi'!AG8&\".\"&\"SORU\",\" \")","v":" "},{"$f":"IF('NOT Baremi'!AH9>0,'NOT Baremi'!AH8&\".\"&\"SORU\",\" \")","v":" "},{"$f":"IF('NOT Baremi'!AI9>0,'NOT Baremi'!AI8&\".\"&\"SORU\",\" \")","v":" "},{"$f":"IF('NOT Baremi'!AJ9>0,'NOT Baremi'!AJ8&\".\"&\"SORU\",\" \")","v":" "},{"$f":"IF('NOT Baremi'!AK9>0,'NOT Baremi'!AK8&\".\"&\"SORU\",\" \")","v":" "},{"$f":"IF('NOT Baremi'!AL9>0,'NOT Baremi'!AL8&\".\"&\"SORU\",\" \")","v":" "},{"$f":"IF('NOT Baremi'!AM9>0,'NOT Baremi'!AM8&\".\"&\"SORU\",\" \")","v":" "},{"$f":"IF('NOT Baremi'!AN9>0,'NOT Baremi'!AN8&\".\"&\"SORU\",\" \")","v":" "},{"$f":"IF('NOT Baremi'!AO9>0,'NOT Baremi'!AO8&\".\"&\"SORU\",\" \")","v":" "},{"$f":"IF('NOT Baremi'!AP9>0,'NOT Baremi'!AP8&\".\"&\"SORU\",\" \")","v":" "},{"$f":"IF('NOT Baremi'!AQ9>0,'NOT Baremi'!AQ8&\".\"&\"SORU\",\" \")","v":" "},{"$f":"IF('NOT Baremi'!AR9>0,'NOT Baremi'!AR8&\".\"&\"SORU\",\" \")","v":" "},"TOPLAM \nPUAN"]
[{"$f":"'Sınıf-Dönem-Sınav Seçim Sayfası'!F4","v":1},{"$f":"IF('Sınıf-Dönem-Sınav Seçim Sayfası'!G4=0,\" \",'Sınıf-Dönem-Sınav Seçim Sayfası'!G4)","v":1301},{"$f":"IF('Sınıf-Dönem-Sınav Seçim Sayfası'!H4=0,\" \",'Sınıf-Dönem-Sınav Seçim Sayfası'!H4)","v":"Hüseyin BAY"},null,null,10,10,10,10,10,10,10,10,10,10,null,null,null,null,null,null,null,null,null,null,null,null,null,null,null,null,null,null,null,null,null,null,null,null,null,null,null,null,null,null,{"$f":"IF(COUNTBLANK(F6:AS6)=COLUMNS(F6:AS6),\" \",IF(SUM(F6:AS6)=0,0,SUM(F6:AS6)))","v":100},{"$f":"IF($AV$4=1,IF(AT6=\" \",\" \",IF(AT6>=85,\"Pekiyi\",IF(AT6>=70,\"İyi\",IF(AT6>=60,\"Orta\",IF(AT6>=50,\"Geçer\",IF(AT6>=0,\"Geçmez\",0)))))),IF(AT6=\" \",\" \",IF(AT6>=85,\"Pekiyi\",IF(AT6>=70,\"İyi\",IF(AT6>=55,\"Orta\",IF(AT6>=45,\"Geçer\",IF(AT6>=0,\"Geçmez\",0)))))))","v":"Pekiyi"}]
[{"$f":"'Sınıf-Dönem-Sınav Seçim Sayfası'!F5","v":2},{"$f":"IF('Sınıf-Dönem-Sınav Seçim Sayfası'!G5=0,\" \",'Sınıf-Dönem-Sınav Seçim Sayfası'!G5)","v":1305},{"$f":"IF('Sınıf-Dönem-Sınav Seçim Sayfası'!H5=0,\" \",'Sınıf-Dönem-Sınav Seçim Sayfası'!H5)","v":"Ahmet KESKİN"},null,null,10,10,10,10,10,10,10,10,10,10,null,null,null,null,null,null,null,null,null,null,null,null,null,null,null,null,null,null,null,null,null,null,null,null,null,null,null,null,null,null,{"$f":"IF(COUNTBLANK(F7:AS7)=COLUMNS(F7:AS7),\" \",IF(SUM(F7:AS7)=0,0,SUM(F7:AS7)))","v":100},{"$f":"IF($AV$4=1,IF(AT7=\" \",\" \",IF(AT7>=85,\"Pekiyi\",IF(AT7>=70,\"İyi\",IF(AT7>=60,\"Orta\",IF(AT7>=50,\"Geçer\",IF(AT7>=0,\"Geçmez\",0)))))),IF(AT7=\" \",\" \",IF(AT7>=85,\"Pekiyi\",IF(AT7>=70,\"İyi\",IF(AT7>=55,\"Orta\",IF(AT7>=45,\"Geçer\",IF(AT7>=0,\"Geçmez\",0)))))))","v":"Pekiyi"}]
[{"$f":"'Sınıf-Dönem-Sınav Seçim Sayfası'!F6","v":3},{"$f":"IF('Sınıf-Dönem-Sınav Seçim Sayfası'!G6=0,\" \",'Sınıf-Dönem-Sınav Seçim Sayfası'!G6)","v":"…"},{"$f":"IF('Sınıf-Dönem-Sınav Seçim Sayfası'!H6=0,\" \",'Sınıf-Dönem-Sınav Seçim Sayfası'!H6)","v":"…"},null,null,null,null,null,null,null,null,null,null,null,null,null,null,null,null,null,null,null,null,null,null,null,null,null,null,null,null,null,null,null,null,null,null,null,null,null,null,null,null,null,null," "," "]
[{"$f":"'Sınıf-Dönem-Sınav Seçim Sayfası'!F7","v":4},{"$f":"IF('Sınıf-Dönem-Sınav Seçim Sayfası'!G7=0,\" \",'Sınıf-Dönem-Sınav Seçim Sayfası'!G7)","v":"…"},{"$f":"IF('Sınıf-Dönem-Sınav Seçim Sayfası'!H7=0,\" \",'Sınıf-Dönem-Sınav Seçim Sayfası'!H7)","v":"…"},null,null,null,null,null,null,null,null,null,null,null,null,null,null,null,null,null,null,null,null,null,null,null,null,null,null,null,null,null,null,null,null,null,null,null,null,null,null,null,null,null,null," "," "]
[{"$f":"'Sınıf-Dönem-Sınav Seçim Sayfası'!F8","v":" "},{"$f":"IF('Sınıf-Dönem-Sınav Seçim Sayfası'!G8=0,\" \",'Sınıf-Dönem-Sınav Seçim Sayfası'!G8)","v":" "},{"$f":"IF('Sınıf-Dönem-Sınav Seçim Sayfası'!H8=0,\" \",'Sınıf-Dönem-Sınav Seçim Sayfası'!H8)","v":" "},null,null,null,null,null,null,null,null,null,null,null,null,null,null,null,null,null,null,null,null,null,null,null,null,null,null,null,null,null,null,null,null,null,null,null,null,null,null,null,null,null,null," "," "]
[{"$f":"'Sınıf-Dönem-Sınav Seçim Sayfası'!F9","v":" "},{"$f":"IF('Sınıf-Dönem-Sınav Seçim Sayfası'!G9=0,\" \",'Sınıf-Dönem-Sınav Seçim Sayfası'!G9)","v":" "},{"$f":"IF('Sınıf-Dönem-Sınav Seçim Sayfası'!H9=0,\" \",'Sınıf-Dönem-Sınav Seçim Sayfası'!H9)","v":" "},null,null,null,null,null,null,null,null,null,null,null,null,null,null,null,null,null,null,null,null,null,null,null,null,null,null,null,null,null,null,null,null,null,null,null,null,null,null,null,null,null,null," "," "]
[{"$f":"'Sınıf-Dönem-Sınav Seçim Sayfası'!F10","v":" "},{"$f":"IF('Sınıf-Dönem-Sınav Seçim Sayfası'!G10=0,\" \",'Sınıf-Dönem-Sınav Seçim Sayfası'!G10)","v":" "},{"$f":"IF('Sınıf-Dönem-Sınav Seçim Sayfası'!H10=0,\" \",'Sınıf-Dönem-Sınav Seçim Sayfası'!H10)","v":" "},null,null,null,null,null,null,null,null,null,null,null,null,null,null,null,null,null,null,null,null,null,null,null,null,null,null,null,null,null,null,null,null,null,null,null,null,null,null,null,null,null,null," "," "]
[{"$f":"'Sınıf-Dönem-Sınav Seçim Sayfası'!F11","v":" "},{"$f":"IF('Sınıf-Dönem-Sınav Seçim Sayfası'!G11=0,\" \",'Sınıf-Dönem-Sınav Seçim Sayfası'!G11)","v":" "},{"$f":"IF('Sınıf-Dönem-Sınav Seçim Sayfası'!H11=0,\" \",'Sınıf-Dönem-Sınav Seçim Sayfası'!H11)","v":" "},null,null,null,null,null,null,null,null,null,null,null,null,null,null,null,null,null,null,null,null,null,null,null,null,null,null,null,null,null,null,null,null,null,null,null,null,null,null,null,null,null,null," "," "]
[{"$f":"'Sınıf-Dönem-Sınav Seçim Sayfası'!F12","v":" "},{"$f":"IF('Sınıf-Dönem-Sınav Seçim Sayfası'!G12=0,\" \",'Sınıf-Dönem-Sınav Seçim Sayfası'!G12)","v":" "},{"$f":"IF('Sınıf-Dönem-Sınav Seçim Sayfası'!H12=0,\" \",'Sınıf-Dönem-Sınav Seçim Sayfası'!H12)","v":" "},null,null,null,null,null,null,null,null,null,null,null,null,null,null,null,null,null,null,null,null,null,null,null,null,null,null,null,null,null,null,null,null,null,null,null,null,null,null,null,null,null,null," "," "]
[{"$f":"'Sınıf-Dönem-Sınav Seçim Sayfası'!F13","v":" "},{"$f":"IF('Sınıf-Dönem-Sınav Seçim Sayfası'!G13=0,\" \",'Sınıf-Dönem-Sınav Seçim Sayfası'!G13)","v":" "},{"$f":"IF('Sınıf-Dönem-Sınav Seçim Sayfası'!H13=0,\" \",'Sınıf-Dönem-Sınav Seçim Sayfası'!H13)","v":" "},null,null,null,null,null,null,null,null,null,null,null,null,null,null,null,null,null,null,null,null,null,null,null,null,null,null,null,null,null,null,null,null,null,null,null,null,null,null,null,null,null,null," "," "]
{"$rows_left_out":107}
{"sheet":"E-OKULA PUAN AKTAR","index":6,"n_rows":47,"n_cols":5,"rows_kept":47,"cut":false,"hidden":false,"merged":[[34,2,34,3],[35,2,35,3],[36,2,36,3],[30,2,30,3],[27,2,27,3],[28,2,28,3],[0,0,1,0],[0,1,0,4],[31,2,31,3],[32,2,32,3],[33,2,33,3],[19,2,19,3],[20,2,20,3],[21,2,21,3],[22,2,22,3],[23,2,23,3],[29,2,29,3],[24,2,24,3],[25,2,25,3],[26,2,26,3],[18,2,18,3],[7,2,7,3],[47,2,47,3],[37,2,37,3],[38,2,38,3],[39,2,39,3],[40,2,40,3],[41,2,41,3],[46,2,46,3],[42,2,42,3],[43,2,43,3],[44,2,44,3],[45,2,45,3],[8,2,8,3],[9,2,9,3],[10,2,10,3],[11,2,11,3],[12,2,12,3],[13,2,13,3],[14,2,14,3],[15,2,15,3],[16,2,16,3],[17,2,17,3],[6,2,6,3],[1,2,1,3],[2,2,2,3],[3,2,3,3],[4,2,4,3],[5,2,5,3]]}
["MEVCUT",{"$f":"'Sınıf-Dönem-Sınav Seçim Sayfası'!J3& \" SINIFI \"&\"  \" &'Sınıf-Dönem-Sınav Seçim Sayfası'!M3","v":"8-A SINIFI   I.SINAV"}]
[null,"Ö.NO","AD SOYAD",null,"PUAN"]
[1,{"$f":"Analiz!B6","v":1301},{"$f":"Analiz!C6","v":"Hüseyin BAY"},null,{"$f":"Analiz!AT6","v":100}]
[2,{"$f":"Analiz!B7","v":1305},{"$f":"Analiz!C7","v":"Ahmet KESKİN"},null,{"$f":"Analiz!AT7","v":100}]
[3,{"$f":"Analiz!B8","v":"…"},{"$f":"Analiz!C8","v":"…"},null,{"$f":"Analiz!AT8","v":" "}]
[4,{"$f":"Analiz!B9","v":"…"},{"$f":"Analiz!C9","v":"…"},null,{"$f":"Analiz!AT9","v":" "}]
[5,{"$f":"Analiz!B10","v":" "},{"$f":"Analiz!C10","v":" "},null,{"$f":"Analiz!AT10","v":" "}]
[6,{"$f":"Analiz!B11","v":" "},{"$f":"Analiz!C11","v":" "},null,{"$f":"Analiz!AT11","v":" "}]
[7,{"$f":"Analiz!B12","v":" "},{"$f":"Analiz!C12","v":" "},null,{"$f":"Analiz!AT12","v":" "}]
[8,{"$f":"Analiz!B13","v":" "},{"$f":"Analiz!C13","v":" "},null,{"$f":"Analiz!AT13","v":" "}]
[9,{"$f":"Analiz!B14","v":" "},{"$f":"Analiz!C14","v":" "},null,{"$f":"Analiz!AT14","v":" "}]
[10,{"$f":"Analiz!B15","v":" "},{"$f":"Analiz!C15","v":" "},null,{"$f":"Analiz!AT15","v":" "}]
[11,{"$f":"Analiz!B16","v":" "},{"$f":"Analiz!C16","v":" "},null,{"$f":"Analiz!AT16","v":" "}]
[12,{"$f":"Analiz!B17","v":" "},{"$f":"Analiz!C17","v":" "},null,{"$f":"Analiz!AT17","v":" "}]
[13,{"$f":"Analiz!B18","v":" "},{"$f":"Analiz!C18","v":" "},null,{"$f":"Analiz!AT18","v":" "}]
{"$rows_left_out":33}
{"sheet":"Yıl-Dönem-Sınav No Liste","index":7,"n_rows":18,"n_cols":6,"rows_kept":18,"cut":false,"hidden":false,"merged":[]}
[]
[null,"Sene","Dönem","Sınavlar","Okul Türü","Grup Adı"]
[null,"2016-2017","I.DÖNEM","I.SINAV","Lise","A"]
[null,"2017-2018","II.DÖNEM","II.SINAV","Ortaokul","B"]
[null,"2018-2019",null,"III.SINAV"]
[null,"2019-2020",null,"I.PERFORMANS (ÖDEV)"]
[null,null,null,"II.PERFORMANS (ÖDEV)"]
[null,null,null,"I.DERS İÇİ PERFORMANS"]
[null,null,null,"II.DERS İÇİ PERFORMANS"]
[null,null,null,"PROJE"]
[null,null,null,"TELAFİ SINAVI"]
[null,null,null,"I.TELAFİ SINAVI"]
[null,null,null,"II.TELAFİ SINAVI"]
[null,null,null,"III.TELAFİ SINAVI"]
[null,null,null,"TEKAR SINAVI"]
{"$rows_left_out":4}
{"sheet":"KULLANIM REHBERİ","index":8,"n_rows":0,"n_cols":0,"rows_kept":0,"cut":false,"hidden":false,"merged":[]}